program: Gaussian 16
title: Rh SPTAD TSS1 no adam2
version: ES64L-G16RevC.01
method: RB3LYP
basis: GenECP
operation: Freq
keyword: #
keyword: B3LYP/genecp
keyword: EmpiricalDispersion=gd3bj
keyword: int=ultrafine
keyword: scf=xqc
keyword: scrf=(pcm,solvent=dichloromethane)
keyword: freq=noraman
hfenergy: -4110.2283508 hartree
pointgroup: C01 [X(C62H50N4O17Rh2)]
dipole: 0.2482799 0.6748796 7.2859942 debye
polarizability: 1005.215581|9.3278649|1030.7813881|9.8131723|48.969506|1120.4746705 unknown
InChI: InChI=1S/C18H18O.4C11H8NO4.2Rh/c1-3-13-18(2)19-16-12-8-7-11-15(16)17(20-18)14-9-5-4-6-10-14;4*1-6(11(15)16)12-9(13)7-4-2-3-5-8(7)10(12)14;;/h3-12H,1,13H2,2H3;4*2-6H,1H3;;/q;4*-2;2*+4
charge 0 multiplicity 1
135 atoms
Rh -0.188826 -0.339771 -0.73648
Rh -0.183818 -0.308888 -3.211876
O  -1.364078 -2.032827 -0.913152
O  -1.936655 0.76478 -0.802406
O  1.596892 -1.367088 -0.840602
O  0.88998 1.443536 -0.839343
O  -1.245547 -2.097908 -3.179492
O  1.659492 -1.258723 -3.111317
O  0.798733 1.48779 -3.110938
O  -1.977229 0.741876 -3.077097
C  -1.692084 -2.464977 -2.063562
C  -2.387848 1.105551 -1.947857
C  2.151986 -1.505017 -1.977931
C  1.121501 1.948733 -1.983544
C  -2.777909 -3.555551 -2.036375
C  -3.56101 2.097557 -1.890265
C  3.619209 -1.942653 -1.932389
C  1.842968 3.301044 -1.98087
C  -3.926339 2.691325 -3.245941
H  -4.774795 3.373669 -3.134425
H  -3.077328 3.232441 -3.668339
H  -4.200431 1.887556 -3.932736
C  4.109478 -2.594845 -3.223494
H  5.176931 -2.822395 -3.139875
H  3.560089 -3.515964 -3.427496
H  3.956001 -1.904586 -4.05499
C  -3.378506 -3.852561 -3.406692
H  -3.842169 -2.955889 -3.822491
H  -2.591487 -4.180221 -4.089589
H  -4.128883 -4.644285 -3.318787
C  2.232057 3.783958 -3.376147
H  2.712567 4.764953 -3.303033
H  2.916542 3.078003 -3.852409
H  1.337865 3.869434 -3.996621
H  1.149047 4.007554 -1.522227
H  4.174453 -1.016832 -1.745904
H  -2.326985 -4.456762 -1.607695
N  2.994883 3.237379 -1.092669
C  3.953983 2.2184 -1.14123
C  3.27774 4.189702 -0.109363
O  3.92408 1.270559 -1.903225
C  4.961897 2.561643 -0.100602
O  2.582871 5.149586 0.171906
C  4.573496 3.763114 0.49807
C  6.076839 1.85879 0.326197
C  5.302653 4.32273 1.534004
C  6.819221 2.416552 1.377198
H  6.328184 0.898245 -0.10832
C  6.443351 3.630814 1.966026
H  4.988987 5.252671 1.997413
H  7.696679 1.894851 1.747416
H  7.040182 4.035897 2.778004
N  3.853443 -2.777299 -0.761444
C  3.230688 -4.02184 -0.554607
C  4.558007 -2.350016 0.365938
O  2.480932 -4.572328 -1.333807
C  3.69583 -4.484688 0.785806
O  5.110705 -1.271483 0.499129
C  4.488677 -3.479115 1.340355
C  3.460343 -5.674908 1.454165
C  5.077481 -3.623994 2.586792
C  4.059777 -5.838133 2.71032
H  2.834261 -6.444136 1.014473
C  4.855006 -4.828736 3.268537
H  5.690837 -2.833987 3.008214
H  3.904054 -6.759754 3.263388
H  5.305527 -4.984053 4.244519
H  -4.411988 1.555859 -1.469142
N  -3.788028 -3.14388 -1.062014
C  -4.412386 -1.885533 -1.088949
C  -3.986319 -3.79878 0.162112
O  -4.336431 -1.082079 -1.998285
C  -5.148232 -1.765791 0.200305
O  -3.483885 -4.858017 0.486507
C  -4.9019 -2.92035 0.947326
C  -5.946494 -0.73981 0.683807
C  -5.458327 -3.101866 2.204425
C  -6.517968 -0.917459 1.95035
H  -6.097885 0.175191 0.121008
C  -6.283608 -2.080831 2.694898
H  -5.259062 -4.001957 2.777062
H  -7.136447 -0.131244 2.369664
H  -6.742117 -2.186343 3.673807
N  -3.215616 3.120286 -0.902448
C  -1.973029 3.777384 -0.904055
C  -3.90262 3.310557 0.300047
O  -1.179917 3.752452 -1.824588
C  -1.872146 4.475795 0.404569
O  -4.956555 2.778846 0.604302
C  -3.056372 4.239858 1.108893
C  -0.840423 5.235113 0.935174
C  -3.269602 4.791734 2.362188
C  -1.045063 5.782686 2.210002
H  0.095634 5.379256 0.404275
C  -2.240916 5.573476 2.907296
H  -4.199424 4.625232 2.896733
H  -0.259107 6.37955 2.66311
H  -2.371797 6.020764 3.888309
C  0.005264 -0.472945 1.403177
C  0.836976 0.632592 1.92241
C  0.183673 -1.831654 1.963913
H  -1.155334 -0.173877 1.674125
C  2.232881 0.681017 1.80166
C  0.213699 1.735567 2.531439
C  1.318702 -2.212132 2.701379
C  -0.840533 -2.784031 1.787208
C  -1.717271 0.49152 2.758241
C  2.957316 1.74042 2.348391
H  2.74573 -0.105067 1.260699
C  0.910123 2.818984 3.038153
O  -1.180971 1.734278 2.580599
C  1.434333 -3.503326 3.211299
C  -0.730753 -4.068543 2.305048
H  -1.71832 -2.504001 1.222108
C  -3.170911 0.41938 2.332585
C  -1.354181 -0.22746 4.030125
C  2.304261 2.813104 2.955176
H  4.038595 1.722806 2.291051
H  0.362075 3.636078 3.492549
C  0.416461 -4.436261 3.015159
H  2.326694 -3.779046 3.762491
H  -1.536264 -4.776941 2.13734
H  -3.25949 0.772691 1.303669
H  -3.484499 -0.627745 2.368045
C  -4.004984 1.256056 3.274451
H  -0.295376 -0.125242 4.27035
H  -1.598246 -1.289184 3.953163
H  -1.950827 0.209546 4.838575
H  2.873342 3.644266 3.358452
H  0.515611 -5.442558 3.412616
H  -3.934254 2.327985 3.12768
C  -4.751175 0.762128 4.261933
H  -4.837773 -0.307629 4.432555
H  -5.31721 1.41108 4.924771
H  2.112662 -1.498497 2.880877
