program: Gaussian 09
title: 000032089
version: EM64L-G09RevD.01
frameworkgroup: C1[X(C19H21NO3S)]
method: RPBEPBE
basis: SDD
operation: Freq
keyword: #p
keyword: freq=noraman
keyword: PBEPBE/SDD
title: #p freq=noraman PBEPBE/SDD
converged: YES YES NO NO
title: Mulliken charges:
elementType: S O O O N C C C C C C C C C C C C C C C C C C C H H H H H H H H H H H H H H H H H H H H H
charge: 0.831220 -0.548592 -0.526984 -0.215870 -0.082240 -0.669029 -0.333938 0.486567 -0.379947 -0.202010 0.197062 -0.351021 0.340138 -0.032872 -0.403332 -0.238270 -0.332549 -0.331904 -0.225083 -0.244717 -0.231164 -0.231426 -0.622132 -0.617298 0.309507 0.226335 0.246825 0.204406 0.235396 0.214144 0.179153 0.239748 0.301609 0.268917 0.291172 0.238830 0.240749 0.248028 0.243083 0.225305 0.188866 0.223730 0.222643 0.188017 0.228926
chargesum: 0.00000
title: Mulliken charges with hydrogens summed into heavy atoms:
elementType: S O O O N C C C C C C C C C C C C C C C C C C C
charge: 0.831220 -0.548592 -0.526984 -0.215870 -0.082240 -0.359522 0.139222 0.486567 0.059855 -0.202010 0.197062 0.042277 0.340138 -0.032872 -0.163584 0.063339 -0.063632 -0.040732 0.013747 -0.003968 0.016865 0.011657 0.015768 0.022289
polarizability: 2.28837851e+02 3.80956175e+01 2.91955647e+02 -1.46765919e+01 6.20480250e-01 2.36504906e+02
1716.lowfreq: -9.3836 -7.4655 -5.1699 -0.0022 -0.0021 -0.0014 15.8827 21.1089 25.3200
frequency: 15.7474 20.8789 25.2640 36.2373 67.8274 82.7959 87.5960 104.0449 111.7938 118.6010 146.3738 158.4338 181.3176 196.0019 212.4275 216.7632 220.4624 234.4178 252.8911 275.6791 289.9384 297.5097 325.9735 352.1282 369.3145 378.3038 396.9115 407.3325 442.7853 450.8488 466.1085 497.3039 509.8945 540.9509 563.5836 577.6535 618.6099 640.0736 652.9216 677.3099 705.1711 730.6358 754.1056 769.8724 773.1399 795.7795 802.1188 802.9697 816.7120 882.8434 887.3519 903.5537 911.2444 921.1191 965.1186 983.2013 999.0882 999.8703 1008.6276 1013.0528 1029.1406 1034.6439 1037.0369 1042.5181 1059.2804 1072.8462 1086.5860 1093.5254 1104.6685 1113.7144 1131.9088 1146.2649 1153.2090 1175.1331 1176.0486 1183.5653 1218.1451 1227.3936 1244.0716 1255.1257 1263.6076 1268.6775 1282.6741 1290.0949 1303.9831 1336.8947 1353.2111 1371.8508 1376.6208 1382.6894 1418.2559 1418.7140 1430.4381 1441.6657 1449.3354 1460.2597 1463.7579 1465.5834 1472.8965 1476.4353 1477.6103 1482.4706 1487.9355 1510.3443 1562.6335 1578.4300 1597.4017 1602.2768 2824.1672 2845.9857 2862.2614 2983.1751 2990.4929 3013.0428 3019.9863 3029.6811 3036.1674 3048.5915 3068.6203 3078.7707 3086.1085 3131.4932 3138.3722 3145.4481 3146.8032 3159.7752 3161.2038 3172.5299 3175.2834
redmass: 3.8241 3.6242 4.8677 5.2935 5.7496 3.4443 4.8012 1.7310 4.4239 3.8695 7.5634 3.7287 4.6690 6.4031 2.2700 5.9795 1.1537 1.6917 4.3866 5.8877 5.3307 4.3290 3.6917 3.0374 4.1571 6.2050 5.2466 4.6947 3.5456 3.0972 3.2640 4.5879 5.0185 3.9104 5.1904 4.2828 6.5908 5.9345 5.5379 4.3406 5.7601 3.0181 1.3542 1.5582 1.6158 3.3017 3.6756 2.6216 4.1072 1.5602 1.5808 1.3986 4.9624 14.9042 1.4167 1.4084 1.3648 6.4932 2.9234 1.3603 2.4004 2.2952 2.3828 2.6004 1.9310 2.3000 1.5497 1.7620 1.9406 1.8932 1.5081 1.8582 1.6161 1.1452 1.0697 1.0911 1.7702 1.9037 1.7087 1.5446 2.4462 2.1563 1.4686 1.2002 1.2767 1.3916 1.7334 4.9477 1.4137 4.3092 2.4578 1.1433 2.3067 1.1587 2.3185 1.0566 1.0679 1.0811 1.0818 1.0797 2.3229 1.0746 1.0722 9.3883 6.2039 6.7411 6.5459 6.1469 1.0700 1.0573 1.0576 1.0601 1.0629 1.0847 1.0722 1.0719 1.0899 1.0949 1.1029 1.1011 1.1003 1.0876 1.0869 1.0895 1.0901 1.0934 1.0943 1.1006 1.0998
irintensity: 1.1991 2.4179 0.9284 2.1089 2.6050 0.1449 0.1109 1.3992 1.2232 1.1599 0.7945 2.4377 6.6439 0.6668 0.6703 14.0344 2.0664 0.3531 0.4394 0.5952 5.4656 7.7029 6.4302 3.2510 11.9725 30.8327 5.6198 6.6037 4.3614 1.3229 4.9560 1.7985 20.5044 28.0566 4.6539 3.9160 3.5289 11.4796 9.4931 28.8251 6.5530 24.9414 15.1684 30.7387 26.8690 13.5918 76.3340 21.8265 20.8068 9.3054 1.6522 2.3461 20.9933 66.9607 3.1543 4.6367 0.9180 0.4843 6.2688 0.9119 32.8777 6.3768 9.3407 0.9681 3.0368 34.2047 11.3361 7.7081 7.1231 24.7974 2.5877 8.5104 12.3418 2.1014 3.4480 0.5107 8.9378 11.5097 48.3920 3.2958 85.6330 116.8203 21.4308 12.6603 15.6699 8.0303 6.1064 7.0296 16.2163 4.8711 18.3436 3.5717 11.0539 3.6809 3.6314 7.5410 10.5096 13.0950 1.8488 13.3828 1.2386 11.9577 21.6230 115.7904 6.7570 7.5945 35.4385 5.0615 60.0347 68.4464 228.8687 0.7155 15.8764 24.5878 39.5881 42.2142 1.2281 3.6877 35.0753 35.1345 48.0084 2.6520 6.3071 7.3657 0.5376 1.6686 11.0944 32.3919 17.1253
temp: 298.150 k
press: 1.00000 atm
elementType: 16 8 8 8 7 6 6 6 6 6 6 6 6 6 6 6 6 6 6 6 6 6 6 6 1 1 1 1 1 1 1 1 1 1 1 1 1 1 1 1 1 1 1 1 1
symmnumber: 1
zpe: 935336.9 jmol-1
zpe.correction: 0.356251 hartree
zpe.thermalcorrener: 0.379742 hartree
zpe.thermalcorrenthalpy: 0.380686 hartree
zpe.thermalcorrgfe: 0.301106 hartree
zpe.sumelectzpe: -1413.165372 hartree
zpe.sumelectthermal: -1413.141881 hartree
zpe.sumelectthermalent: -1413.140937 hartree
zpe.sumelectthermalfe: -1413.220517 hartree
dipole: 2.3730 -0.8428 2.8099
dipole: 3.7732
quadrupole: -143.2605 -128.0292 -166.2437
quadrupole: 7.9717 -16.9569 -6.7255
quadrupole: 2.5839 17.8153 -20.3992 7.9717 -16.9569 -6.7255
hfenergy: -1413.5216228 hartree
pointgroup: C01 [X(C19H21N1O3S1)]
dipole: -0.8618881 0.4563865 1.1192045 debye
polarizability: 241.1204172|45.2985948|280.1007787|14.5141527|-3.1908187|236.0772088 unknown
InChI: InChI=1S/C19H21NO3S/c1-20(2)13-7-12-17-14-8-3-4-9-15(14)19(21)16-10-5-6-11-18(16)24(17,22)23/h3-6,8-11,17H,7,12-13H2,1-2H3
charge 0 multiplicity 1
45 atoms
S  1.36336 0.059165 -1.963936
O  1.146433 1.269712 -3.050074
O  2.217796 -1.258844 -2.405796
O  0.988142 -0.644821 2.757532
N  -4.795813 1.408617 0.372251
C  -0.424561 -0.510874 -1.28514
C  -1.117165 0.691371 -0.635642
C  -0.176675 -1.762278 -0.499666
C  -2.641065 0.437927 -0.502815
C  2.17948 0.883421 -0.439725
C  0.540693 -1.795454 0.735526
C  -3.341174 1.622318 0.198757
C  1.985829 0.490863 0.908767
C  1.132016 -0.626095 1.493178
C  -0.685214 -2.974618 -1.03213
C  2.997519 1.962641 -0.818958
C  0.683728 -3.040946 1.408876
C  2.700214 1.253523 1.88401
C  -0.515644 -4.204223 -0.365517
C  0.174691 -4.236049 0.866494
C  3.698237 2.682663 0.171432
C  3.546697 2.3185 1.529407
C  -5.556403 1.505037 -0.890297
C  -5.369145 2.277169 1.421625
H  -0.904568 -0.741365 -2.253978
H  -0.694211 0.909824 0.361805
H  -0.949878 1.584663 -1.270876
H  -3.06909 0.280446 -1.511994
H  -2.835866 -0.479596 0.082609
H  -2.897937 1.741059 1.206601
H  -3.121971 2.568786 -0.36479
H  -1.22423 -2.944664 -1.985732
H  3.05218 2.242005 -1.876965
H  1.208933 -3.050897 2.368409
H  2.555708 0.971631 2.931665
H  -0.91429 -5.125188 -0.803418
H  0.319052 -5.18206 1.398331
H  4.343171 3.519762 -0.114975
H  4.081015 2.869107 2.310486
H  -5.192868 0.762448 -1.620682
H  -5.491651 2.518268 -1.364773
H  -6.621313 1.286401 -0.695279
H  -6.432201 2.018556 1.575583
H  -5.313823 3.369167 1.178283
H  -4.837137 2.110926 2.375125
