program: Gaussian 16
title: Rh RPTAD TSS2 no adamant freq
version: ES64L-G16RevC.01
method: RB3LYP
basis: GenECP
operation: Freq
keyword: #
keyword: scrf=(pcm,solvent=dichloromethane)
keyword: scf=xqc
keyword: b3lyp/genecp
keyword: freq=noraman
keyword: empiricaldispersion=gd3bj
keyword: int=ultrafine
hfenergy: -4110.2317724 hartree
pointgroup: C01 [X(C62H50N4O17Rh2)]
dipole: -1.1583151 3.0662232 7.6093831 debye
polarizability: 1037.2741059|-9.8348566|1033.4919106|-69.9041485|81.5643512|1188.5812217 unknown
InChI: InChI=1S/C18H18O.4C11H8NO4.2Rh/c1-3-9-15(2)19-18-13-8-7-12-17(18)14-16-10-5-4-6-11-16;4*1-6(11(15)16)12-9(13)7-4-2-3-5-8(7)10(12)14;;/h3-8,10-14H,1,9H2,2H3;4*2-6H,1H3;;/q;4*-2;2*+4
charge 0 multiplicity 1
135 atoms
Rh 0.160079 -0.315057 -0.748674
Rh 0.279064 -0.761158 -3.176859
O  0.717916 -2.272475 -0.435045
O  0.811901 -2.714069 -2.663269
O  -1.864577 -0.807201 -0.872418
O  -1.749295 -1.161977 -3.112972
O  -0.337017 1.640732 -1.21831
O  -0.204205 1.249718 -3.45291
O  2.148153 0.232978 -0.887281
O  2.284603 -0.229618 -3.107535
C  1.024672 -2.978168 -1.446356
C  -0.43586 1.969924 -2.443611
C  2.73297 0.212711 -2.014779
C  -2.364302 -1.048734 -2.012987
C  -3.89403 -1.134188 -2.069085
C  -4.438342 -1.63266 -3.40712
C  4.146085 0.81467 -2.005844
C  4.727555 1.065586 -3.392952
C  -0.883558 3.421483 -2.681942
C  -1.334039 3.709173 -4.110536
C  1.736575 -4.297307 -1.105411
C  2.238655 -5.063823 -2.326301
C  0.076899 0.086958 1.474416
C  -1.273675 -0.29319 1.933929
C  1.268804 -0.390632 2.195711
C  -1.744128 -1.611929 2.028196
C  -2.178958 0.7041 2.33611
C  1.262851 -1.483018 3.083457
C  2.47352 0.332511 2.059513
C  -3.002955 -1.892898 2.563012
H  -1.11904 -2.41493 1.654649
C  -3.440718 0.46467 2.844898
C  2.407195 -1.828802 3.802003
H  0.355515 -2.054234 3.233464
C  3.610982 -0.008483 2.781452
H  2.498405 1.170698 1.373839
C  -3.85329 -0.864634 2.972522
H  -3.326876 -2.92434 2.64623
H  -4.069046 1.294619 3.144134
C  3.582303 -1.090677 3.665817
H  2.37456 -2.678795 4.478035
H  4.523071 0.562538 2.641301
H  -4.831561 -1.089368 3.381872
H  4.469565 -1.363888 4.225732
H  0.184846 1.130724 1.161038
O  -1.736105 2.031124 2.156795
C  -0.5115 2.283067 2.582628
C  -0.06932 1.835255 3.940673
C  0.165555 3.422846 1.911914
H  1.01299 1.6829 3.936425
H  -0.553657 0.898373 4.218479
C  -0.468228 2.951062 4.894816
H  1.219347 3.454054 2.190602
H  0.067331 3.351102 0.828675
H  -0.301159 4.364342 2.229633
H  0.240451 3.767903 5.009945
C  -1.643426 2.973385 5.525365
H  -2.370398 2.173229 5.405403
H  -1.91223 3.78596 6.194076
H  1.402519 -5.300834 -2.988519
H  2.710729 -5.996862 -2.004778
H  2.964372 -4.467245 -2.883439
H  -4.094529 -2.649035 -3.613952
H  -4.098051 -0.97992 -4.21364
H  -5.532263 -1.62285 -3.381695
H  4.779557 0.125329 -3.946468
H  5.736609 1.477756 -3.299349
H  4.104544 1.766007 -3.953319
H  -0.519232 3.494663 -4.805485
H  -1.610181 4.763652 -4.202496
H  -2.192978 3.089432 -4.376994
N  -4.398613 -1.927977 -0.958788
C  -3.989129 -3.240443 -0.693321
C  -5.407775 -1.501718 -0.088408
O  -3.10894 -3.830691 -1.29374
C  -4.838235 -3.709953 0.436166
O  -5.92188 -0.396591 -0.089848
C  -5.696624 -2.667198 0.795218
C  -4.843112 -4.920256 1.111446
C  -6.596326 -2.79741 1.840764
H  -4.168543 -5.722257 0.830697
C  -5.746765 -5.060996 2.174787
C  -6.609734 -4.017249 2.532495
H  -7.257454 -1.982466 2.11658
H  -5.779106 -5.992896 2.730262
H  -7.298812 -4.155975 3.359582
N  -1.915815 3.731093 -1.697077
C  -3.015452 2.886176 -1.474833
C  -1.75462 4.656162 -0.659357
O  -3.335928 1.968498 -2.209221
C  -3.637071 3.341054 -0.205778
O  -0.832989 5.449244 -0.560498
C  -2.891503 4.422314 0.275551
C  -4.722194 2.831945 0.489498
C  -3.210043 5.044074 1.471921
H  -5.27027 1.968253 0.126314
C  -5.053425 3.460068 1.699829
C  -4.311599 4.544909 2.182902
H  -2.626601 5.879315 1.845373
H  -5.896232 3.092981 2.277458
H  -4.591355 5.00367 3.126041
N  4.099228 2.02623 -1.191284
C  3.142895 3.035436 -1.383966
C  4.741461 2.146085 0.047938
O  2.397074 3.114856 -2.34437
C  3.231684 3.919754 -0.192238
O  5.566955 1.366287 0.489827
C  4.189505 3.382762 0.674362
C  2.521111 5.067665 0.124054
C  4.470796 3.974396 1.896285
H  1.754777 5.458409 -0.536679
C  2.804157 5.675867 1.35581
C  3.760093 5.138091 2.227216
H  5.208501 3.550706 2.569558
H  2.264399 6.572118 1.644717
H  3.95126 5.62878 3.176357
N  2.814203 -4.002852 -0.164877
C  3.797785 -3.027419 -0.376282
C  2.950422 -4.622565 1.086427
O  3.895311 -2.343068 -1.379841
C  4.661997 -3.048086 0.833315
O  2.1977 -5.469487 1.532017
C  4.173702 -4.030515 1.698806
C  5.788157 -2.300993 1.140996
C  4.810145 -4.323092 2.894505
H  6.139117 -1.513088 0.483087
C  6.441936 -2.593382 2.345987
C  5.966567 -3.593325 3.203548
H  4.42772 -5.088395 3.561698
H  7.329921 -2.033261 2.621886
H  6.497245 -3.798389 4.128153
H  1.028423 -4.910256 -0.538675
H  -4.240191 -0.11366 -1.882351
H  -0.026062 4.0491 -2.421039
H  4.773587 0.112012 -1.451184
