program: Gaussian 16
title: Rh RPTAD SM no adam 2 (from pIRC)
version: ES64L-G16RevC.01
method: RB3LYP
basis: GenECP
operation: Freq
keyword: #N
keyword: Geom=AllCheck
keyword: Guess=TCheck
keyword: SCRF=Check
keyword: GenChk
keyword: RB3LYP/GenECP
keyword: Freq
hfenergy: -4110.2561958 hartree
pointgroup: C01 [X(C62H50N4O17Rh2)]
dipole: -0.9098393 -0.0642362 6.6741386 debye
polarizability: 1094.3867691|13.799112|878.257402|-26.2665927|-30.3722973|1164.3327632 unknown
InChI: InChI=1S/C18H18O.4C11H8NO4.2Rh/c1-3-9-15(2)19-18-13-8-7-12-17(18)14-16-10-5-4-6-11-16;4*1-6(11(15)16)12-9(13)7-4-2-3-5-8(7)10(12)14;;/h3-8,10-13,15H,1,9H2,2H3;4*2-6H,1H3;;/q;4*-2;2*+4
charge 0 multiplicity 1
135 atoms
C  -3.65156607 0.17314565 1.87609865
C  -2.42061408 0.37876701 1.27251469
C  -1.25799774 -0.28493576 1.7341594
C  -1.40443359 -1.26624152 2.75885003
C  -2.66320667 -1.5098492 3.31127138
C  -3.77010032 -0.77297068 2.90021674
H  -4.51878881 0.72808992 1.5418681
H  -2.30657188 1.10308089 0.47745123
H  -2.74987158 -2.27442412 4.07543611
H  -4.73504599 -0.95897226 3.35913428
C  0.03028077 0.0733683 1.18713797
C  1.09557935 0.35267238 2.11820554
C  0.78698621 0.90775663 3.38756852
C  2.44980659 0.08046904 1.81252907
C  1.78839663 1.16870821 4.31004255
H  -0.24511354 1.14302578 3.62118831
C  3.44041383 0.30008641 2.75974527
H  2.69108533 -0.35160435 0.85299195
C  3.11493269 0.84682793 4.00441025
H  1.54075343 1.61252388 5.26898577
H  4.46933692 0.06358636 2.52601438
H  3.89877603 1.03096508 4.73322832
Rh 0.24508723 0.15794316 -0.82201079
Rh 0.49907465 0.23648178 -3.30006588
O  -1.5491165 -0.83174851 -1.14893393
O  -0.77039709 1.94247245 -0.99186727
O  1.34496844 -1.59443741 -0.87837749
O  2.01190712 1.20816044 -0.75038108
O  -1.35527338 -0.69141169 -3.40694796
O  1.4862253 -1.59136359 -3.14702597
O  2.29957329 1.24130417 -3.00373556
O  -0.44521904 2.0855603 -3.23643443
C  -1.97127726 -0.96801909 -2.33894255
C  -0.8700859 2.50950553 -2.13031609
C  1.77755034 -2.0201719 -2.00083967
C  2.6049792 1.55490124 -1.8241126
C  -3.41789278 -1.4474866 -2.50491173
C  -1.5739945 3.86966222 -2.08831107
C  2.76794772 -3.1895586 -1.89245473
C  3.82321235 2.46380292 -1.59562214
H  -4.0142681 -0.52933874 -2.56741389
H  -0.89533127 4.5334245 -1.54472893
H  2.22188109 -4.03663088 -1.46521763
H  4.6393661 1.81039768 -1.27168477
O  -0.3631542 -1.98145778 3.26736298
C  0.49603087 -2.76330892 2.38999266
C  -0.27192746 -3.94869134 1.79612855
H  -1.09629247 -3.54585276 1.19464113
C  1.68538403 -3.15674595 3.24679408
H  2.23103031 -2.26670301 3.57220135
H  2.3578881 -3.79721081 2.67168408
H  0.8287381 -2.13922464 1.55697918
H  0.40152605 -4.4619712 1.09966555
C  -0.80015034 -4.91017362 2.82113895
H  -1.44904495 -4.48232395 3.58462884
C  -0.53165445 -6.21722821 2.84967421
H  0.11446087 -6.68109127 2.10697547
H  -0.94677059 -6.87103722 3.61239423
H  1.34927182 -3.7103754 4.12914416
N  -2.75680963 3.74186942 -1.24668558
C  -2.90912478 4.38157275 -0.0084934
C  -3.75631921 2.78352043 -1.4696
O  -2.13086137 5.18943062 0.46611389
C  -4.18338683 3.85743703 0.56041446
O  -3.77503791 2.00985544 -2.41188448
C  -4.7009643 2.90794617 -0.32740543
C  -4.83100532 4.16849923 1.7454089
C  -5.8887712 2.24074943 -0.07051586
C  -6.03478389 3.50107138 2.0161727
H  -4.42079777 4.89930284 2.43432022
C  -6.55576663 2.55719234 1.12263418
H  -6.26328244 1.48326069 -0.7478718
H  -6.57109073 3.71822793 2.934497
H  -7.48738284 2.05431063 1.36227165
N  3.76482365 -2.83930011 -0.88574868
C  3.93622553 -3.54600336 0.31248272
C  4.52906994 -1.66337542 -0.91589794
O  3.3383915 -4.56424593 0.61250333
C  4.95615085 -2.78600934 1.08894188
O  4.49747249 -0.83408641 -1.80817071
C  5.31845553 -1.65814905 0.34457494
C  5.51703456 -3.04466394 2.32949899
C  6.25531442 -0.74797648 0.80882326
C  6.47173772 -2.13434758 2.80701874
H  5.22815271 -3.91666781 2.90637044
C  6.83647758 -1.00795849 2.05924555
H  6.50730094 0.14106685 0.24200781
H  6.93372042 -2.30342563 3.77441325
H  7.57269566 -0.31827558 2.4593447
N  -3.88479735 -2.12606298 -1.30791781
C  -5.03357864 -1.74445819 -0.60354858
C  -3.24782842 -3.22864334 -0.72054647
O  -5.77193688 -0.82514212 -0.91052376
C  -5.14168456 -2.68940409 0.54075064
O  -2.24286661 -3.76737747 -1.1481939
C  -4.05985793 -3.57145606 0.48090273
C  -6.08858214 -2.7674992 1.54927721
C  -3.88054676 -4.5624571 1.43322603
C  -5.91220322 -3.7604011 2.52332317
H  -6.92588019 -2.07836208 1.58632644
C  -4.82336704 -4.63919009 2.46836145
H  -3.03826324 -5.24353938 1.39039688
H  -6.62916355 -3.84931879 3.33350799
H  -4.70968446 -5.39667762 3.2375878
C  -1.89663803 4.44761823 -3.46258053
H  -2.37041385 5.42647327 -3.34493371
H  -0.97548464 4.56817115 -4.03713837
H  -2.56854835 3.78738789 -4.01483288
C  3.40421449 -3.58379111 -3.22207837
H  4.08328499 -4.42687526 -3.06607086
H  2.62844599 -3.88146173 -3.93136608
H  3.96067868 -2.74571305 -3.64671443
C  -3.6327224 -2.29224994 -3.76311399
H  -3.32113365 -1.73061645 -4.64545407
H  -3.05159961 -3.21643224 -3.70921484
H  -4.69299864 -2.54373589 -3.85728765
N  3.51645133 3.31306154 -0.44896776
C  4.11451738 3.13901303 0.80984072
C  2.29107202 3.99533969 -0.34847915
O  5.13023127 2.49906376 1.01699284
C  3.24168602 3.85990282 1.77783099
O  1.54484036 4.21467115 -1.28731397
C  2.12727556 4.34421245 1.0843582
C  3.37132809 4.03623787 3.14580726
C  1.08666604 4.99366132 1.73160486
C  2.33255502 4.70243433 3.81144541
H  4.23571108 3.65867376 3.68046971
C  1.20662066 5.16401062 3.11872297
H  0.20909533 5.33234886 1.19025447
H  2.39522169 4.85117398 4.88490226
H  0.41143471 5.66044952 3.66611783
C  4.23874523 3.25750264 -2.82990262
H  5.12043171 3.86157819 -2.59751201
H  4.48256349 2.57294964 -3.64531221
H  3.42935912 3.91522861 -3.15395835
