program: Gaussian 09
title: 000032033
version: EM64L-G09RevD.01
frameworkgroup: C1[X(C4H8S3)]
method: RPBEPBE
basis: SDD
operation: Freq
keyword: #p
keyword: freq=noraman
keyword: PBEPBE/SDD
title: #p freq=noraman PBEPBE/SDD
converged: NO YES NO NO
title: Mulliken charges:
elementType: S S S C C C C H H H H H H H H
charge: 0.258381 0.098962 0.098966 -0.704299 -0.704300 -0.556106 -0.556106 0.321564 0.321565 0.231028 0.226593 0.253064 0.231029 0.226593 0.253064
chargesum: 0.00000
title: Mulliken charges with hydrogens summed into heavy atoms:
elementType: S S S C C C C
charge: 0.258381 0.098962 0.098966 -0.382734 -0.382735 0.154580 0.154579
polarizability: 1.05380207e+02 -1.69808847e-05 9.34794870e+01 9.86599282e+00 1.54881213e-05 7.41284232e+01
1716.lowfreq: -0.0012 0.0024 0.0026 12.0003 16.2497 21.8638 74.1246 133.8469 250.0990
frequency: 73.9564 133.8436 250.0988 254.6952 270.3393 284.7853 316.2336 329.6470 394.0020 412.7184 456.8725 574.7700 578.0537 596.4965 636.4586 972.7548 980.1505 1032.6738 1047.6254 1071.7853 1077.9685 1134.7967 1164.7432 1244.5674 1252.4196 1390.2914 1390.9011 1449.7147 1450.1479 1465.1719 1465.6446 2984.8880 2984.9498 3048.6362 3049.6965 3080.9559 3081.2449 3101.0372 3101.7830
redmass: 3.9204 4.8961 1.5637 1.2698 1.5148 3.3202 3.4149 5.5135 14.1276 5.0383 11.6476 3.5066 4.4946 6.5151 4.5596 1.4044 1.4673 1.3169 1.3203 3.4318 3.2257 1.1696 1.1963 1.2316 1.2355 1.1976 1.2002 1.0391 1.0398 1.0448 1.0451 1.0353 1.0352 1.0848 1.0855 1.1002 1.0997 1.0996 1.0997
irintensity: 2.2899 1.3582 0.0501 0.9059 0.5322 2.0300 0.5700 0.0078 0.9925 7.0427 0.0052 0.7074 4.7503 8.9973 6.5414 32.1329 1.4978 4.3184 24.2092 5.6979 0.1367 0.5001 1.1424 18.5935 2.3700 43.6633 0.3248 24.8369 6.7660 5.1462 12.8715 47.5347 0.5315 1.4131 0.2811 5.3546 23.6618 18.0059 0.9069
temp: 298.150 k
press: 1.00000 atm
elementType: 16 16 16 6 6 6 6 1 1 1 1 1 1 1 1
symmnumber: 1
zpe: 296599.2 jmol-1
zpe.correction: 0.112969 hartree
zpe.thermalcorrener: 0.121734 hartree
zpe.thermalcorrenthalpy: 0.122679 hartree
zpe.thermalcorrgfe: 0.079228 hartree
zpe.sumelectzpe: -1350.834637 hartree
zpe.sumelectthermal: -1350.825872 hartree
zpe.sumelectthermalent: -1350.824928 hartree
zpe.sumelectthermalfe: -1350.868378 hartree
dipole: 0.0000 0.8669 0.0000
dipole: 0.8669
quadrupole: -57.7803 -70.5453 -65.5916
quadrupole: -0.0001 2.2432 0.0000
quadrupole: 6.8588 -5.9062 -0.9526 -0.0001 2.2432 0.0000
hfenergy: -1350.947606 hartree
pointgroup: C01 [X(C4H8S3)]
dipole: 0.0000015 0.3410612 -0.0000163 debye
dipolederiv: -0.4796897 -0.0000023 0.0340493 -0.0000016 -0.2420248 0.0000026 0.0052767 0.0000048 -0.1567199 -0.1595303 0.1134669 0.0744261 0.0280104 -0.1646729 0.0459379 0.0517469 0.055656 -0.0798391 -0.1595283 -0.1134646 0.0744316 -0.0280102 -0.1646719 -0.0459323 0.0517487 -0.0556482 -0.0798299 0.4755348 -0.0437492 -0.081561 -0.1097542 0.2610658 -0.1125822 -0.0919036 -0.0797258 0.1124025 0.4755305 0.0437491 -0.0815621 0.1097524 0.2610707 0.1125738 -0.0919081 0.0797118 0.1123916 -0.1329977 -0.002037 0.0978742 -0.0314385 -0.0546961 0.0143486 0.0308896 0.012017 -0.0737831 -0.1329934 0.0020434 0.0978731 0.0314422 -0.0546937 -0.0143489 0.0308893 -0.0120178 -0.073783 0.0025891 -0.0222872 -0.0272255 -0.0098553 0.0404277 -0.0308424 0.0108426 0.0038347 -0.0205658 0.0025893 0.0222869 -0.0272263 0.0098562 0.040429 0.0308385 0.0108431 -0.0038381 -0.0205677 0.0410917 -0.0624246 0.0399574 -0.0991289 -0.0802196 0.0386434 0.0576181 0.0379233 0.0932257 -0.0889076 0.0882 -0.0206573 0.1329265 0.0429525 0.0493818 -0.0381025 0.0478375 0.062737 0.1020647 -0.0380783 -0.099839 0.0086482 0.0761524 -0.0720519 -0.0237285 -0.0426678 -0.0158173 0.0410918 0.0624254 0.0399538 0.0991316 -0.0802232 -0.0386346 0.0576127 -0.0379137 0.0932299 -0.0889093 -0.0882021 -0.0206537 -0.1329298 0.0429469 -0.0493811 -0.0380972 -0.0478368 0.0627423 0.1020642 0.0380735 -0.0998405 -0.0086491 0.0761573 0.072047 -0.023728 0.0426632 -0.015823 unknown
polarizability: 104.1054056|0.0002643|93.479487|11.6427023|-0.0004135|75.4032248 unknown
InChI: InChI=1S/C4H8S3/c1-3-5-4(2)7-6-3/h3-4H,1-2H3
charge 0 multiplicity 1
15 atoms
S  -0.000021 1.570572 -0.000129
S  0.626831 -1.338934 0.952276
S  -0.626846 -1.338979 -0.952409
C  1.377005 0.350691 0.540454
C  -1.377031 0.350652 -0.540675
C  2.489691 0.271893 -0.505369
C  -2.48972 0.271906 0.505149
H  1.72822 0.732678 1.516046
H  -1.728241 0.732592 -1.516288
H  2.878116 1.281929 -0.730359
H  3.323849 -0.352308 -0.135695
H  2.104925 -0.165645 -1.442371
H  -2.878147 1.281952 0.73009
H  -3.323878 -0.352314 0.135505
H  -2.104953 -0.165586 1.442173
