program: Gaussian 09
title: 000032031
version: EM64L-G09RevD.01
frameworkgroup: C1[X(C10H12O2)]
method: RPBEPBE
basis: SDD
operation: Freq
keyword: #pfreq=noraman
keyword: PBEPBE/SDD
title: #p freq=noraman PBEPBE/SDD
converged: YES YES NO NO
title: Mulliken charges:
elementType: O O C C C C C C C C C C H H H H H H H H H H H H
charge: -0.296279 -0.259068 0.371893 0.090456 0.473084 -0.579877 -0.321246 -0.400993 -0.787959 -0.808478 0.164601 -0.501604 0.236723 0.274840 0.235030 0.210286 0.247190 0.247172 0.228308 0.226870 0.239239 0.239816 0.240209 0.229787
chargesum: 0.00000
title: Mulliken charges with hydrogens summed into heavy atoms:
elementType: O O C C C C C C C C C C
charge: -0.296279 -0.259068 0.371893 0.090456 0.473084 -0.343154 -0.046406 -0.165963 -0.083310 -0.114061 0.164601 0.208208
polarizability: 1.68931634e+02 3.56150446e+00 1.23587214e+02 -5.69385729e-01 -6.15057754e-03 6.07225959e+01
1716.lowfreq: -17.1866 -9.0012 -2.3478 -0.0006 -0.0004 -0.0003 11.8694 40.2969 75.8190
frequency: -12.9502 40.2905 75.8065 114.4029 151.4881 154.8826 166.9059 201.5929 278.6101 291.8259 301.2532 330.9518 373.5860 442.2267 489.8822 539.4248 553.0043 594.2264 682.3087 717.2069 753.4275 756.8393 843.4863 891.8630 900.5337 944.8090 986.5021 987.9614 1025.4986 1042.8545 1044.8468 1048.3154 1113.0864 1145.7025 1147.4534 1175.3105 1240.6922 1249.0039 1290.8934 1375.0410 1393.7477 1396.3210 1409.1561 1423.9857 1451.5102 1453.9678 1462.6651 1465.2588 1471.9085 1472.7830 1493.2454 1568.4282 1615.8907 1623.1806 2975.6849 2990.9322 3000.5574 3057.6214 3076.0348 3088.3086 3090.5150 3099.7828 3118.8463 3130.8458 3143.2036 3178.9298
redmass: 1.0195 5.1550 3.1989 1.1661 3.6174 3.1720 1.1523 2.3049 2.7287 4.4774 5.2255 3.9443 5.1685 2.8488 3.5405 3.3509 5.0534 5.3662 4.1917 5.6465 5.5848 3.6110 1.4235 1.3176 4.2075 4.3981 1.3687 1.4831 1.5144 1.7329 4.3465 1.6774 1.2640 1.4623 1.7173 1.6618 3.3828 2.5994 1.5489 5.9500 1.9859 1.3059 1.3359 1.1946 1.0500 1.0454 1.2145 1.0535 1.1708 1.0606 2.4443 6.6814 7.7113 7.1163 1.0391 1.0365 1.0298 1.0942 1.0959 1.1000 1.1013 1.1041 1.0912 1.0904 1.1044 1.0942
irintensity: 0.5024 1.3691 1.3208 0.3272 2.0426 5.7656 1.5764 2.0499 1.3776 3.3150 8.9100 8.7453 3.0850 4.8499 2.7417 0.1537 0.6897 2.2917 19.2078 1.9776 8.4563 9.3939 28.0568 1.4910 9.4531 0.0535 1.1282 0.2318 3.9855 15.7363 182.9006 50.2480 0.0743 67.9595 47.0144 8.2004 246.0600 7.5026 1.8283 7.5870 5.3071 11.5427 19.6003 25.9578 11.6660 13.9210 13.4849 13.5085 34.2871 13.6440 8.3493 41.9867 78.7189 195.5732 28.0079 19.8541 45.7360 21.4736 9.9160 15.1434 25.5126 29.7479 25.0547 14.8871 18.0630 3.8376
temp: 298.150 k
press: 1.00000 atm
elementType: 8 8 6 6 6 6 6 6 6 6 6 6 1 1 1 1 1 1 1 1 1 1 1 1
symmnumber: 1
zpe: 509114.6 jmol-1
zpe.correction: 0.193911 hartree
zpe.thermalcorrener: 0.205648 hartree
zpe.thermalcorrenthalpy: 0.206592 hartree
zpe.thermalcorrgfe: 0.155793 hartree
zpe.sumelectzpe: -537.833598 hartree
zpe.sumelectthermal: -537.821861 hartree
zpe.sumelectthermalent: -537.820917 hartree
zpe.sumelectthermalfe: -537.871717 hartree
dipole: -1.3088 -1.3590 0.0688
dipole: 1.8880
quadrupole: -57.7851 -68.5571 -73.1750
quadrupole: -5.7146 -0.2637 -0.0251
quadrupole: 8.7206 -2.0513 -6.6693 -5.7146 -0.2637 -0.0251
hfenergy: -538.0275093 hartree
pointgroup: C01 [X(C10H12O2)]
dipole: -0.5399149 0.5054966 0.0685335 debye
dipolederiv: -1.2374173 -0.3928127 -0.1051589 -0.7757131 -0.8935047 -0.1447534 -0.186383 -0.1352119 -0.3334979 -0.9006155 0.2516658 0.0398498 0.1288194 -0.8149675 -0.1053605 0.0154121 -0.1047752 -0.3259411 0.2663221 -0.2594432 -0.0490762 0.0893957 0.3310412 0.0674038 0.0159952 0.0611812 0.0270545 -0.8251669 -0.0083295 -0.0249122 0.0712606 -0.1720027 -0.0246336 -0.0011647 -0.026108 -0.0544034 0.5476282 -0.0453465 0.0277581 -0.0298201 0.1502858 0.0278669 0.1045439 0.0200487 0.0117859 -0.3053468 0.2921921 0.0612017 0.2748786 -0.1279619 0.0283602 0.0505766 0.0261449 -0.185337 0.2270597 0.0588177 0.0227076 -0.2006813 -0.0114733 0.019077 -0.0437099 0.0232935 -0.0954845 -0.4077606 -0.1304299 -0.0350278 -0.2174106 0.0196532 0.0335947 -0.0598514 0.0387688 -0.1856108 0.0406287 0.2336943 0.0523781 0.0954064 -0.1240787 -0.028999 0.0251003 -0.0248866 0.016993 -0.2119012 0.0324382 -0.0194037 0.0556687 0.0688765 0.007289 -0.1574934 0.0224218 0.054945 1.9866237 0.0844663 0.0592493 0.5151871 1.3350972 0.2483928 0.1472567 0.2395139 0.278871 0.7344179 0.1824283 0.0483366 0.1154963 0.2712681 0.0005008 0.0343617 0.0028635 0.2831914 0.0018569 -0.0864785 -0.0193859 -0.1099883 -0.045526 -0.0448928 -0.0202916 -0.0408088 0.1337792 0.0966956 -0.0631926 -0.0146779 -0.0695808 0.0136095 -0.0323764 -0.0140431 -0.0329447 0.1431063 0.0238239 0.0884299 0.0194253 0.0920625 -0.0677178 -0.0448029 0.0232422 -0.049913 0.141944 -0.0689225 -0.1972553 -0.0471937 -0.0687129 -0.0335971 -0.0312411 -0.019157 -0.0340906 0.0938958 0.043817 0.0128866 0.1011068 -0.0050888 0.0547084 0.0149888 0.0944111 -0.0208394 -0.0198318 0.0529298 0.0515293 -0.0839365 0.0328959 0.0378771 0.014213 -0.0856072 0.0515562 -0.0127734 0.0045741 -0.0368149 0.0225927 -0.1247046 -0.0770282 0.0641562 0.0675138 0.0389032 0.0934409 0.0267616 0.0175347 0.01645 0.0791138 -0.0338598 -0.118171 0.0952397 -0.106945 0.0240243 -0.0259518 0.0246992 -0.0477814 0.0312777 0.0997008 0.0441842 -0.0901949 0.0498709 -0.0866093 -0.0562317 -0.0424196 0.0259301 0.0507588 0.0924099 -0.0621457 0.0933217 -0.0258599 -0.0874805 -0.0497638 -0.0297286 -0.0403235 0.0822664 0.0257108 0.1191382 -0.0622122 0.0778916 -0.0234877 0.0359388 -0.0385311 -0.0101083 -0.1127874 -0.0985207 -0.0517892 -0.0268668 -0.0500755 0.1074264 unknown
polarizability: 169.0894316|-1.9215791|120.5767518|2.7070125|12.8666943|63.57526 unknown
InChI: InChI=1S/C10H12O2/c1-7-4-5-9(8(2)6-7)10(11)12-3/h4-6H,1-3H3
charge 0 multiplicity 1
24 atoms
O  2.441549 1.048319 0.455718
O  2.524695 -1.222024 -0.029425
C  -0.472202 -1.236212 -0.097647
C  0.347508 -0.090085 0.16825
C  -2.497674 0.189022 0.168621
C  -1.878498 -1.058987 -0.08725
C  -0.266723 1.166205 0.430941
C  -1.664453 1.306631 0.433727
C  0.086562 -2.617747 -0.383563
C  -4.00814 0.330161 0.136266
C  1.833224 -0.191363 0.177708
C  3.919142 1.029586 0.484049
H  -2.512485 -1.932353 -0.285847
H  0.376648 2.025591 0.635491
H  -2.114713 2.284158 0.642552
H  -0.733716 -3.334651 -0.560424
H  0.752874 -2.61139 -1.263951
H  0.710055 -2.9847 0.450526
H  -4.510751 -0.604055 0.442157
H  -4.353529 1.141732 0.80025
H  -4.358854 0.571445 -0.886418
H  4.319911 0.722488 -0.497042
H  4.282207 0.32663 1.253055
H  4.208363 2.0628 0.723554
