program: Gaussian 09
title: [Os(en)2Cl(H)]+ LANL2TZ(f)
version: AS64L-G09RevD.01
frameworkgroup: C1[X(C4H17ClN4Os)]
method: RM06
basis: Gen
operation: Freq
keyword: #PGeom=AllCheck
keyword: Guess=TCheck
keyword: SCRF=Check
keyword: GenChk
keyword: RM06/ChkBas
keyword: Freq
converged: YES YES NO YES
title: Mulliken charges:
elementType: C C N Os N C C N N H H H H H H H H H H H H H H H H H Cl
charge: -0.115278 -0.101500 -0.666571 -0.139944 -0.665103 -0.115222 -0.101554 -0.666588 -0.665103 0.130121 0.161207 0.129357 0.183725 0.161226 0.130107 0.129351 0.183730 0.330363 0.327875 0.331906 0.324148 0.324161 0.331881 0.330383 0.327885 -0.027095 -0.573467
chargesum: 0.00000
title: Mulliken charges with hydrogens summed into heavy atoms:
elementType: C C N Os N C C N N Cl
charge: 0.197803 0.189828 -0.010517 -0.167039 -0.006835 0.197860 0.189779 -0.010546 -0.006865 -0.573467
polarizability: 1.70308600e+02 -8.52319167e-03 1.39878693e+02 -4.28587063e+00 -4.97102873e-02 1.21357006e+02
1716.lowfreq: -21.2310 -21.1920 -11.6115 0.0013 0.0021 0.0028 59.2766 71.0551 84.1118
frequency: 59.1630 71.0224 84.1019 111.9180 116.7177 134.6162 203.0976 214.7890 224.2547 279.9033 301.6772 314.6461 357.3388 391.8919 431.1594 467.1552 510.1778 526.5414 587.3171 623.7129 655.1830 662.8476 693.8029 701.6854 863.7816 884.3396 891.3867 894.9118 969.9899 975.1669 1010.2524 1012.5885 1017.2561 1023.3058 1068.2649 1068.5122 1090.0759 1093.1789 1126.4571 1129.4642 1274.8093 1275.5415 1291.9256 1293.5094 1323.4336 1324.8471 1376.7817 1378.8933 1421.0802 1421.8830 1456.9675 1457.4619 1459.0019 1459.0571 1613.7034 1614.8480 1619.3004 1622.9797 1868.8454 3016.3490 3016.6204 3025.8245 3026.7239 3081.2872 3081.3628 3097.6474 3097.6910 3420.5886 3425.9836 3482.2286 3482.7432 3566.2898 3566.7083 3569.6970 3570.1871
redmass: 4.4359 3.1075 8.2882 4.2096 2.4836 2.3257 3.6220 7.0123 4.1756 3.9614 2.0357 1.6808 4.9485 4.1812 3.8541 4.4424 1.4360 1.7362 1.1338 1.2018 1.2143 1.3297 1.1824 1.4382 1.7081 1.8807 2.1506 2.3408 1.3479 1.3079 1.4743 1.6107 1.3972 1.4862 1.7638 1.4870 1.8581 1.7023 1.1601 1.2202 1.3798 1.3776 1.2317 1.2232 1.2134 1.2158 1.3212 1.3180 1.5464 1.5390 1.1016 1.0996 1.1009 1.1020 1.0831 1.0881 1.0844 1.0884 1.0123 1.0621 1.0621 1.0626 1.0626 1.1039 1.1040 1.1040 1.1039 1.0601 1.0595 1.0512 1.0512 1.0906 1.0927 1.0891 1.0910
irintensity: 8.0103 2.8333 8.0182 6.5285 0.4766 9.0041 49.3762 23.9394 0.3671 6.1257 1.4176 1.9174 0.1294 1.0376 10.2773 0.2266 1.9867 5.7953 2.2434 1.8291 7.3052 0.0964 2.8576 15.4750 0.0080 2.2168 1.7455 0.0957 63.1133 1.4779 0.4267 73.4441 100.5076 0.8748 1.9517 11.7863 2.0809 0.0119 1.2221 17.0919 0.0997 0.6101 0.1184 0.0001 0.2719 4.3190 0.6809 0.2992 0.2454 7.9072 13.3412 3.0675 8.2113 6.8948 10.0165 20.9913 117.7587 0.7402 650.3530 79.8946 6.0958 197.0930 0.0928 28.6234 7.2830 14.1488 18.6589 47.6705 8.8110 15.0228 0.5094 5.2421 5.9673 52.5638 19.8009
temp: 298.150 k
press: 1.00000 atm
elementType: 6 6 7 76 7 6 6 7 7 1 1 1 1 1 1 1 1 1 1 1 1 1 1 1 1 1 17
symmnumber: 1
zpe: 627599.6 jmol-1
zpe.correction: 0.239040 hartree
zpe.thermalcorrener: 0.252377 hartree
zpe.thermalcorrenthalpy: 0.253321 hartree
zpe.thermalcorrgfe: 0.198476 hartree
zpe.sumelectzpe: -932.097867 hartree
zpe.sumelectthermal: -932.084531 hartree
zpe.sumelectthermalent: -932.083586 hartree
zpe.sumelectthermalfe: -932.138431 hartree
dipole: -0.0009 -3.8650 0.0093
dipole: 3.8650
quadrupole: -65.4935 -110.8347 -70.9772
quadrupole: -0.0033 0.5039 0.1226
quadrupole: 16.9417 -28.3996 11.4579 -0.0033 0.5039 0.1226
hfenergy: -932.3369074 hartree
pointgroup: C01 [X(C4H17Cl1N4Os1)]
dipole: 0.0005308 -1.520458 0.0226622 debye
polarizability: 170.3212507|-0.0613489|139.8748484|-4.2125503|-0.2715057|121.3482 unknown
InChI: InChI=1S/2C2H8N2.ClH.Os.H/c2*3-1-2-4;;;/h2*1-4H2;1H;;/q;;;+1;/p-1
charge 0 multiplicity 1
27 atoms
C  2.89047923 0.258612 0.67976318
C  2.92190488 -0.45000975 -0.65431507
N  1.66616882 -0.13420572 -1.36347312
Os 0.00080854 -0.23781439 0.01202017
N  -1.66315264 -0.18695569 -1.38057478
C  -2.88904378 0.23877799 -0.66943669
C  -2.92024304 -0.43243526 0.68383587
N  -1.66469775 -0.09625399 1.38401828
N  1.66470718 -0.14760591 1.40251167
H  3.8147053 -0.15202614 -1.2240664
H  2.94935346 -1.53761494 -0.50705231
H  3.80495927 0.05193457 1.25367228
H  2.81976629 1.34224125 0.51779502
H  -2.94704893 -1.52373764 0.56695494
H  -3.81323993 -0.11917199 1.24501429
H  -3.80347237 0.01596176 -1.23735774
H  -2.81865786 1.32652284 -0.53766511
H  1.47468665 0.54225499 2.12821583
H  1.80300961 -1.04857202 1.85476252
H  1.69605817 0.83617155 -1.69076087
H  1.57478912 -0.73712781 -2.17619943
H  -1.5730578 -0.67634683 2.21316656
H  -1.69544353 0.88275873 1.68436818
H  -1.47325386 0.4825166 -2.12516039
H  -1.80093677 -1.10028201 -1.8074536
H  0.0015069 -1.90241395 0.03575498
Cl -0.00004368 2.35340357 -0.02551973
