program: Gaussian 09
title: trans-[Ru(DMeO)2(H2)H]+
version: AS64L-G09RevD.01
frameworkgroup: C1[X(C36H83O8P4Ru)]
method: RM06
basis: Gen
operation: Freq
keyword: #P
keyword: Geom=AllCheck
keyword: Guess=TCheck
keyword: SCRF=Check
keyword: GenChk
keyword: RM06/ChkBas
keyword: Freq
converged: YES YES NO YES
title: Mulliken charges:
elementType: P Ru P P C C P C C H H H H H H H H H H H H C H H O C H H C H H C H H H C H H O C H H C H H C H H H C H H O C H H C H H C H H H C H H O C H H C H H C H H H C H H O C H H C H H C H H H C H H O C H H C H H C H H H C H H O C H H C H H C H H H C H H O C H H C H H C H H
charge: 0.571063 -1.070477 0.581092 0.589027 -0.413637 -0.407404 0.597650 -0.404708 -0.405410 0.169715 0.164662 0.167615 0.176696 0.178286 0.171564 0.170530 0.156696 0.010390 0.011396 0.034582 0.146600 -0.109658 0.114172 0.102117 -0.490917 0.077486 0.086185 0.099463 -0.229876 0.165099 0.132137 -0.386563 0.120991 0.162002 0.150571 -0.116387 0.113229 0.113647 -0.503763 0.064239 0.111385 0.098180 -0.236193 0.146297 0.137433 -0.392556 0.137439 0.160506 0.103303 -0.110533 0.153058 0.109483 -0.501432 0.072372 0.109212 0.091851 -0.231778 0.136188 0.148123 -0.376604 0.120555 0.170809 0.111567 -0.117740 0.143676 0.123781 -0.503358 0.057351 0.094534 0.112433 -0.216098 0.138967 0.159729 -0.409423 0.150888 0.163875 0.148237 -0.110937 0.103510 0.115158 -0.492882 0.072663 0.100433 0.098919 -0.232933 0.141332 0.155564 -0.381480 0.157647 0.137487 0.148808 -0.113325 0.101922 0.126178 -0.518061 0.066158 0.113973 0.093599 -0.227714 0.153281 0.102521 -0.417645 0.161616 0.175766 0.123699 -0.121940 0.145336 0.109434 -0.488702 0.062112 0.108302 0.083467 -0.226869 0.143241 0.153916 -0.382201 0.156218 0.137326 0.117125 -0.116680 0.147521 0.117239 -0.513254 0.061730 0.102063 0.108834 -0.233165 0.132938 0.154657 -0.410152 0.152495 0.168134
chargesum: 1.00000
title: Mulliken charges with hydrogens summed into heavy atoms:
elementType: P Ru P P C C P C C C O C C C C O C C C C O C C C C O C C C C O C C C C O C C C C O C C C C O C C C
charge: 0.571063 -1.014109 0.581092 0.589027 -0.079260 -0.063094 0.597650 -0.077482 -0.055560 0.253231 -0.490917 0.263135 0.067360 -0.103570 0.261060 -0.503763 0.273804 0.047537 -0.094611 0.255312 -0.501432 0.273436 0.052532 -0.085240 0.261284 -0.503358 0.264318 0.082599 -0.094661 0.255968 -0.492882 0.272015 0.063963 -0.086346 0.263582 -0.518061 0.273731 0.028088 -0.080262 0.256530 -0.488702 0.253881 0.070288 -0.088657 0.265204 -0.513254 0.272627 0.054429 -0.089523
polarizability: 6.07126534e+02 7.55744581e+00 5.75922394e+02 -8.94900713e-01 -9.80614068e+00 5.27923847e+02
1716.lowfreq: -3.6741 -1.4252 -0.0019 -0.0017 -0.0010 5.1254 12.4041 13.0449 17.0941
temp: 298.150 k
press: 1.00000 atm
elementType: 15 44 15 15 6 6 15 6 6 1 1 1 1 1 1 1 1 1 1 1 1 6 1 1 8 6 1 1 6 1 1 6 1 1 1 6 1 1 8 6 1 1 6 1 1 6 1 1 1 6 1 1 8 6 1 1 6 1 1 6 1 1 1 6 1 1 8 6 1 1 6 1 1 6 1 1 1 6 1 1 8 6 1 1 6 1 1 6 1 1 1 6 1 1 8 6 1 1 6 1 1 6 1 1 1 6 1 1 8 6 1 1 6 1 1 6 1 1 1 6 1 1 8 6 1 1 6 1 1 6 1 1
symmnumber: 1
zpe: 3063100.6 jmol-1
zpe.correction: 1.166673 hartree
zpe.thermalcorrener: 1.235148 hartree
zpe.thermalcorrenthalpy: 1.236092 hartree
zpe.thermalcorrgfe: 1.056164 hartree
zpe.sumelectzpe: -3481.137285 hartree
zpe.sumelectthermal: -3481.068811 hartree
zpe.sumelectthermalent: -3481.067867 hartree
zpe.sumelectthermalfe: -3481.247794 hartree
dipole: -0.0922 1.6234 -2.9322
dipole: 3.3528
quadrupole: -261.6592 -289.8394 -316.7691
quadrupole: 0.0891 -1.9811 8.6770
quadrupole: 27.7633 -0.4169 -27.3465 0.0891 -1.9811 8.6770
hfenergy: -3482.3039583 hartree
pointgroup: C01 [X(C36H83O8P4Ru1)]
dipole: -0.0208195 0.6418242 -1.1522444 debye
polarizability: 607.5826933|6.4490987|575.4900209|-1.6197364|-9.7102133|527.9000611 unknown
InChI: InChI=1S/2C18H40O4P2.Ru.3H/c2*1-19-9-5-13-23(14-6-10-20-2)17-18-24(15-7-11-21-3)16-8-12-22-4;;;;/h2*5-18H2,1-4H3;;;;
charge 1 multiplicity 1
132 atoms
P  1.51061601 -0.94828944 1.27674536
Ru 0.09553717 0.2449221 -0.20557955
P  -1.49506459 -0.17895472 1.47498478
P  1.69730873 0.72503947 -1.86960409
C  0.8473827 1.09505443 -3.49006816
C  -0.54230173 0.4909801 -3.548127
P  -1.44915104 0.663231 -1.93444148
C  0.56217672 -1.39593471 2.82049735
C  -0.56081816 -0.39956037 3.05961808
H  1.47811753 0.75850613 -4.32371123
H  0.78995858 2.18978188 -3.55871125
H  -1.14788478 0.92485685 -4.3563474
H  -0.48766645 -0.59313931 -3.7260371
H  -0.15965223 0.58688956 3.33643592
H  -1.23121883 -0.71981496 3.86796803
H  1.24960166 -1.45472016 3.67312818
H  0.1500368 -2.40457349 2.67769293
H  0.06728326 1.99016671 0.20617317
H  -0.15651805 -1.22646228 -0.83475177
H  0.68312633 1.67905403 0.70629683
H  0.49041027 -7.50366817 -1.60071828
C  1.33628175 -6.87802584 -1.30778055
H  1.97199121 -7.44220386 -0.60656157
H  1.92972236 -6.63394533 -2.2038559
O  0.82105915 -5.71457967 -0.71056639
C  1.83412847 -4.84311166 -0.28747086
H  2.50041462 -4.5920213 -1.13663332
H  2.45929842 -5.32288936 0.49103061
C  1.17755958 -3.58937012 0.24885552
H  0.55897411 -3.15295677 -0.54806489
H  0.48688825 -3.88194903 1.05380095
C  2.19888698 -2.58186901 0.75344945
H  2.95083669 -2.37287213 -0.02458434
H  2.74648724 -2.9963447 1.61287113
H  7.57954913 -0.62133303 5.31131293
C  6.93013879 0.0534185 4.74978136
H  6.52270594 0.81274874 5.4360941
H  7.5255117 0.56442897 3.97643803
O  5.90499284 -0.72071595 4.17665498
C  5.01206134 0.05181352 3.42402167
H  5.54126823 0.57753462 2.60415234
H  4.54825712 0.8361006 4.05411989
C  3.94689621 -0.8648062 2.85748633
H  4.45042251 -1.66588733 2.30006571
H  3.41980283 -1.34716285 3.69290887
C  3.00073939 -0.0891097 1.95294893
H  3.55635549 0.29291854 1.08709098
H  2.61244858 0.80492414 2.46968938
H  -7.09529284 -3.47812951 2.35197243
C  -6.38219474 -4.09929534 2.91845454
H  -6.85080202 -4.41548236 3.85268697
H  -6.14170238 -4.99232094 2.31847532
O  -5.22293017 -3.3749309 3.24476623
C  -4.52107352 -2.95364416 2.10954096
H  -5.17145207 -2.34324108 1.44858001
H  -4.1815574 -3.82660577 1.51475509
C  -3.3377419 -2.11835621 2.5504664
H  -3.73136173 -1.23568644 3.07319607
H  -2.75357377 -2.68292824 3.28970892
C  -2.47605981 -1.73546098 1.35096688
H  -3.10504383 -1.60771028 0.4598264
H  -1.77078604 -2.53619568 1.08702894
H  -4.5838132 5.74899127 1.11918302
C  -3.8384036 5.8256566 1.92892455
H  -3.33274974 6.79208669 1.85939248
H  -4.36324313 5.76917772 2.89509371
O  -2.85927205 4.8216858 1.81562973
C  -3.39616346 3.53494323 1.97274113
H  -4.20188262 3.35985264 1.22915454
H  -3.8561896 3.42449236 2.97288148
C  -2.28302832 2.53159414 1.76909606
H  -1.86794523 2.69091579 0.76338844
H  -1.46966795 2.75377652 2.47553053
C  -2.7650546 1.09626709 1.92256837
H  -3.6453149 0.9202554 1.28474067
H  -3.09390167 0.91017529 2.95524109
H  -1.20441852 7.85247715 -1.55711146
C  -1.96013991 7.06627645 -1.49944807
H  -2.37410571 7.03933936 -0.47834566
H  -2.77459277 7.30072114 -2.2033482
O  -1.33663037 5.84871294 -1.82482799
C  -2.22802424 4.76869118 -1.77951852
H  -3.04157968 4.90377541 -2.51903144
H  -2.7000242 4.69981693 -0.77758461
C  -1.45117359 3.50234166 -2.06841296
H  -0.94115593 3.61221975 -3.03656301
H  -0.66251364 3.41130623 -1.30446782
C  -2.34783446 2.27404968 -2.06750823
H  -2.98112387 2.2462809 -2.96772525
H  -3.0311534 2.31165197 -1.20307107
H  -7.87098501 -2.08389919 -0.07413745
C  -7.0408747 -2.35396847 -0.73124775
H  -6.57613133 -3.28433416 -0.36079827
H  -7.43007966 -2.53731806 -1.74442557
O  -6.12392669 -1.28583459 -0.71987309
C  -5.01016711 -1.53220027 -1.53525559
H  -5.32439322 -1.76940382 -2.56916878
H  -4.45310776 -2.41802077 -1.16371572
C  -4.1218945 -0.30607426 -1.51719496
H  -4.67310663 0.53890004 -1.9495745
H  -3.94131761 -0.03971686 -0.4666723
C  -2.81615461 -0.54443312 -2.26349021
H  -3.00174786 -0.53383689 -3.34815955
H  -2.4005383 -1.53443278 -2.02388264
H  4.57919166 -4.70222416 -4.6042215
C  3.84737756 -5.02817259 -3.84887629
H  3.30500504 -5.89537545 -4.23368718
H  4.39274924 -5.32073115 -2.93544836
O  2.90389176 -4.01969103 -3.57899703
C  3.50446333 -2.83975775 -3.11979004
H  4.23875298 -2.46424512 -3.85811353
H  4.06970789 -3.03330768 -2.18332205
C  2.42148752 -1.81208805 -2.87367681
H  1.8811968 -1.64608864 -3.81687316
H  1.68846418 -2.22941658 -2.16707819
C  2.99186008 -0.50528197 -2.34303502
H  3.65337677 -0.03453797 -3.08749111
H  3.60757845 -0.69066597 -1.44868159
H  6.8025597 4.81048836 -0.21283076
C  6.15185759 4.69892025 0.66865311
H  6.77531183 4.58087143 1.55739912
H  5.54577904 5.61232204 0.77475251
O  5.33842217 3.55492662 0.56232186
C  4.49235335 3.60537951 -0.55570171
H  5.08368754 3.70309986 -1.4865247
H  3.82799788 4.48950384 -0.50198697
C  3.67585478 2.33239896 -0.57477108
H  4.37651218 1.48408604 -0.61309988
H  3.13840619 2.26320907 0.38105967
C  2.69466293 2.28113144 -1.73112303
H  3.21678543 2.41305234 -2.69270073
H  1.96993192 3.10589065 -1.64961153
