program: Gaussian 09
title: 000032146
version: EM64L-G09RevD.01
frameworkgroup: C1[X(C19H25ClN2)]
method: RPBEPBE
basis: SDD
operation: Freq
keyword: #p
keyword: freq=noraman
keyword: PBEPBE/SDD
title: #p freq=noraman PBEPBE/SDD
converged: YES YES NO NO
title: Mulliken charges:
elementType: Cl N N C C C C C C C C C C C C C C C C C C C H H H H H H H H H H H H H H H H H H H H H H H H H
charge: -0.063082 -0.103087 -0.374095 -0.346240 -0.384726 -0.377312 0.479895 0.472672 -0.322748 -0.327112 -0.671137 -0.673288 -0.460144 -0.350212 -0.425277 -0.369523 -0.204651 -0.214887 -0.222896 -0.242325 -0.111680 -0.243565 0.202146 0.176047 0.223144 0.193010 0.245990 0.257985 0.186155 0.203756 0.187777 0.204895 0.228785 0.210065 0.205089 0.228228 0.208256 0.205363 0.236444 0.259373 0.225528 0.267655 0.253690 0.252768 0.222884 0.223292 0.227097
chargesum: 0.00000
title: Mulliken charges with hydrogens summed into heavy atoms:
elementType: Cl N N C C C C C C C C C C C C C C C C C C C
charge: -0.063082 -0.103087 -0.116110 -0.144094 0.014465 0.061688 0.479895 0.472672 0.067163 0.065560 -0.027198 -0.031441 -0.223700 -0.090839 -0.199749 -0.101869 0.049039 0.037881 -0.000012 -0.019033 -0.111680 -0.016468
polarizability: 2.61447157e+02 -2.76289277e+01 2.20375795e+02 6.18312940e+00 -7.26594435e+00 2.04345968e+02
1716.lowfreq: -6.3542 -2.7983 0.0008 0.0017 0.0017 0.7133 8.6653 17.9521 27.5771
frequency: 8.2986 17.5898 27.3332 32.0453 35.1448 51.5585 68.1947 72.6947 84.4174 116.2283 122.0438 162.4862 178.7822 196.2746 212.6175 220.5008 231.6051 251.1996 281.2124 298.5635 321.4986 323.4453 352.3818 391.3150 404.6555 408.1951 433.3409 453.1165 463.3004 491.0010 495.3893 564.0293 606.8026 616.0951 627.0229 676.5816 691.5855 708.4633 721.4612 747.0210 756.5843 792.6956 795.4240 803.1586 814.9798 827.4544 841.5237 848.0884 860.4651 914.8108 933.3323 947.9736 962.9678 983.6063 985.3226 990.2736 999.5397 1003.8373 1019.3707 1026.4897 1052.6426 1070.1987 1072.7305 1074.6027 1078.5481 1084.2850 1087.1066 1105.0830 1125.1623 1126.4986 1161.6198 1169.4083 1177.0269 1180.9060 1191.7700 1204.9908 1208.0380 1231.1780 1263.6170 1277.3221 1287.2674 1290.5594 1293.5004 1301.8198 1324.9356 1334.8077 1361.1669 1364.7660 1380.3070 1384.3057 1386.2699 1386.9282 1389.4763 1396.2023 1439.2986 1447.5156 1459.9538 1461.9889 1469.1837 1473.3890 1475.3541 1478.3195 1479.6846 1485.0611 1489.2726 1494.3653 1587.7861 1594.5715 1596.2367 1611.5629 2833.8541 2847.0720 2848.8415 2860.1114 2877.7086 2982.0290 2982.7517 3021.0040 3031.2778 3043.6909 3059.6474 3073.8345 3075.3441 3091.7005 3092.1983 3110.1987 3121.7974 3126.8163 3134.4415 3144.8626 3151.3654 3160.9826 3168.1785 3172.5367 3438.3098
redmass: 3.8815 3.7424 3.9672 5.5896 4.3278 3.9025 3.2433 3.0206 2.1124 5.0864 2.4180 2.3674 2.7590 2.4247 2.5696 1.5521 3.5463 3.2815 1.9143 2.5251 3.7592 4.0741 3.4763 4.2069 2.8995 2.8883 3.4391 3.3020 3.0772 3.0954 3.6140 3.3083 3.2311 6.4128 4.7659 4.5816 2.1314 1.9257 2.7526 2.5520 2.0261 1.2248 1.1375 1.4484 1.7644 1.2473 2.4480 2.9082 1.2618 1.9005 1.4384 1.3821 1.3766 2.4191 1.3985 5.3648 4.1131 1.3224 2.6034 2.0666 2.7618 2.5630 1.8463 1.8278 1.8050 2.1343 2.7849 1.4656 2.0793 2.8763 1.5244 1.0861 1.1290 1.1282 2.5247 2.3937 2.2375 1.5301 1.4180 1.1274 1.2493 1.3648 1.2323 1.3351 1.4141 1.3467 1.3378 1.3779 3.8195 2.6032 1.3783 1.2396 2.3888 2.1453 2.1472 1.2573 1.0589 1.0540 1.0605 2.4301 1.0645 2.2425 1.0636 1.0602 1.0720 1.0852 7.3494 6.2296 6.3480 6.1567 1.0719 1.0720 1.0816 1.0713 1.0712 1.0358 1.0358 1.0872 1.0874 1.0843 1.0909 1.0986 1.0980 1.1003 1.1002 1.0874 1.0858 1.0898 1.0908 1.0955 1.0881 1.1013 1.0953 1.0970 1.0746
irintensity: 0.1305 0.0499 0.0040 0.1521 0.1420 0.0339 0.1321 0.0292 0.1363 0.5406 1.9265 0.8869 0.7093 1.4142 0.9688 0.1994 3.0961 0.5566 2.2117 0.2183 0.7878 0.6390 1.2787 2.9737 0.5520 0.0942 11.0136 4.8080 3.0492 14.4080 20.6973 28.1933 23.6946 0.3837 14.4549 13.2672 16.8312 44.1344 15.5280 12.4723 80.8181 6.1432 4.7075 12.9977 24.9216 0.5601 16.9182 7.7100 0.1677 1.3911 2.7948 0.3660 0.2887 7.5775 0.1254 0.8706 45.5184 4.0598 6.7722 12.7341 8.0702 33.2649 11.4010 25.0418 18.9568 9.1614 40.9598 18.1866 40.2009 28.3279 14.4465 0.9365 1.9783 0.8532 4.8557 4.8428 30.0550 19.7418 7.1862 1.7519 23.0506 30.9688 3.5289 2.1095 2.2516 12.6522 3.0010 9.5152 0.1547 4.7221 23.6020 18.7788 3.2506 5.1666 13.5990 52.4866 0.3968 6.0460 0.8173 85.5286 1.3273 13.0080 18.7078 6.7408 17.0561 3.3252 1.4028 0.5877 8.9265 7.5835 61.0122 33.4761 55.1405 230.7954 103.4509 35.2166 28.7662 18.3841 20.2558 11.4287 34.2564 37.9481 87.5574 36.9292 44.5696 8.9859 0.2775 9.2564 12.9645 30.9297 3.2817 31.9102 7.1487 0.7848 0.8515
temp: 298.150 k
press: 1.00000 atm
elementType: 17 7 7 6 6 6 6 6 6 6 6 6 6 6 6 6 6 6 6 6 6 6 1 1 1 1 1 1 1 1 1 1 1 1 1 1 1 1 1 1 1 1 1 1 1 1 1
symmnumber: 1
zpe: 1038313.9 jmol-1
zpe.correction: 0.395473 hartree
zpe.thermalcorrener: 0.418307 hartree
zpe.thermalcorrenthalpy: 0.419251 hartree
zpe.thermalcorrgfe: 0.338380 hartree
zpe.sumelectzpe: -1306.907236 hartree
zpe.sumelectthermal: -1306.884402 hartree
zpe.sumelectthermalent: -1306.883458 hartree
zpe.sumelectthermalfe: -1306.964329 hartree
dipole: -2.5551 -0.5382 0.6935
dipole: 2.7017
quadrupole: -153.3044 -136.4117 -129.9816
quadrupole: 8.0308 6.8011 -2.8285
quadrupole: -13.4052 3.4875 9.9176 8.0308 6.8011 -2.8285
hfenergy: -1307.3027088 hartree
pointgroup: C01 [X(C19H25Cl1N2)]
dipole: 1.0133908 0.0660779 0.3138479 debye
polarizability: 259.4120646|-24.6610678|214.73449|-16.390442|11.6943002|212.0223648 unknown
InChI: InChI=1S/C19H25ClN2/c1-3-22(4-2)15-14-21-19(16-8-6-5-7-9-16)17-10-12-18(20)13-11-17/h5-13,19,21H,3-4,14-15H2,1-2H3
charge 0 multiplicity 1
47 atoms
Cl -6.148351 2.467571 0.331251
N  4.186627 1.151172 0.270615
N  0.419677 0.698133 0.10404
C  -0.605549 -0.249459 0.60764
C  2.790331 1.373453 -0.177394
C  1.817969 0.353308 0.448974
C  -1.983785 0.421242 0.538556
C  -0.583616 -1.571777 -0.183905
C  5.197174 1.476973 -0.77093
C  4.473169 1.788027 1.584719
C  5.278201 0.408626 -1.877973
C  5.606961 1.089589 2.359735
C  -2.779334 0.555912 1.701308
C  -2.479954 0.923492 -0.692032
C  -1.050081 -2.762728 0.424077
C  -0.142469 -1.615358 -1.528625
C  -4.050186 1.174788 1.65017
C  -3.742712 1.549894 -0.7630
C  -1.08806 -3.9749 -0.300517
C  -0.174985 -2.826393 -2.255072
C  -4.509864 1.662999 0.41367
C  -0.651394 -4.010482 -1.645562
H  -0.422843 -0.511077 1.680979
H  2.443287 2.414235 0.057027
H  2.735966 1.269987 -1.27519
H  1.983166 0.302311 1.553453
H  2.048748 -0.649697 0.049668
H  0.189223 1.664989 0.370966
H  5.006266 2.48222 -1.226691
H  6.182579 1.542361 -0.274728
H  4.709016 2.877054 1.466844
H  3.55007 1.734103 2.191938
H  5.529732 -0.57246 -1.439261
H  4.31994 0.30208 -2.418405
H  6.053298 0.677397 -2.620116
H  5.352353 0.028748 2.527806
H  6.565562 1.125183 1.811197
H  5.764923 1.57848 3.339488
H  -2.408362 0.177367 2.661346
H  -1.874959 0.820182 -1.598215
H  -1.390391 -2.741561 1.467611
H  0.236854 -0.691832 -1.980742
H  -4.663402 1.276875 2.550034
H  -4.12583 1.935625 -1.712303
H  -1.452982 -4.889011 0.181705
H  0.172796 -2.848452 -3.294454
H  -0.676982 -4.950292 -2.208703
