program: Gaussian 09
title: [CpRu(PTA)2(H)]
version: AM64L-G09RevC.01
frameworkgroup: C1[X(C22H40N6P2Ru)]
method: RM06
basis: Gen
operation: Freq
keyword: #pm06
keyword: integral=grid=ultrafine
keyword: gen
keyword: pseudo=read
keyword: scfcyc=60
keyword: freq
title: #p m06 integral=grid=ultrafine gen pseudo=read scfcyc=60 freq
basis: NPDir=0 NMtPBC= 1 NCelOv= 1 NCel= 1 NClECP= 1 NCelD= 1
basis: NCelK= 1 NCelE2= 1 NClLst= 1 CellRange= 0.0.
basis: One-electron integrals computed using PRISM.
basis: 1 Symmetry operations used in ECPInt.
basis: ECPInt: NShTT= 33153 NPrTT= 160031 LenC2= 27564 LenP2D= 79387.
basis: LDataN: DoStor=T MaxTD1= 7 Len= 274
basis: NBasis= 671 RedAO= T NBF= 671
basis: NBsUse= 671 1.00D-06 NBFU= 671
converged: YES YES NO YES
title: Mulliken atomic charges:
elementType: C N C N C N C P C C Ru P C N C N C N C C C C C C C C H H H H H H H H H H H H H H H H H H H H H H H H H C C C C C H H H H H H H H H H H H H H H
charge: 0.005366 -0.376934 0.004534 -0.378464 0.005438 -0.376741 -0.245132 0.580076 -0.232766 -0.238464 -0.579560 0.584228 -0.236092 -0.375945 0.007813 -0.377070 0.003952 -0.376890 0.006347 -0.245621 -0.239815 0.000334 0.010871 0.011630 -0.004067 0.052382 0.061719 0.136041 0.117267 0.100360 0.140249 0.130215 0.153641 0.127026 0.123773 0.126179 0.126221 0.120551 0.127761 0.148934 0.112224 0.130585 0.126351 0.103066 0.154362 0.126820 0.128219 0.127478 0.119550 0.128162 0.119789 -0.410300 -0.414982 -0.414483 -0.422532 -0.415579 0.139554 0.133382 0.143636 0.143102 0.137911 0.111384 0.130975 0.104663 0.147636 0.134333 0.111556 0.142596 0.114543 0.135869 0.140784
chargesum: 0.00000
title: Mulliken charges with hydrogens summed into heavy atoms:
elementType: C N C N C N C P C C Ru P C N C N C N C C C C C C C C C C C C C
charge: 0.253679 -0.376934 0.256934 -0.378464 0.256237 -0.376741 0.038725 0.580076 0.007843 0.014844 -0.517841 0.584228 0.020844 -0.375945 0.254841 -0.377070 0.258991 -0.376890 0.254299 0.011808 0.021342 0.000334 0.010871 0.011630 -0.004067 0.052382 -0.027026 -0.023787 -0.026000 -0.005960 -0.023182
polarizability: 3.78547182e+02 3.77797485e-01 3.75528150e+02 -5.47245690e-01 1.45635226e+00 2.83133607e+02
1716.lowfreq: -5.3019 -0.0011 0.0012 0.0013 5.6675 10.6779 20.9437 29.9120 52.2180
frequency: 20.8465 29.8424 52.1901 58.3497 62.6610 84.7337 112.9144 125.0700 129.2373 136.2246 137.8690 145.6221 151.1187 151.4469 162.7247 166.0130 171.9236 182.8039 208.6492 223.2141 230.7226 244.4197 269.7101 272.7994 277.5688 286.6772 291.1863 306.8352 316.9095 318.9031 361.5953 364.6698 373.4928 394.5397 396.3107 398.0091 399.5776 401.2366 421.0946 460.4609 461.7670 464.4441 466.3671 490.2234 499.5411 535.1953 537.1003 541.6009 583.0008 585.5218 585.8997 588.2409 588.6009 596.2984 600.6278 614.8550 621.2704 626.2856 654.9934 656.6569 725.1160 729.1487 733.0096 737.3639 751.1385 758.9770 761.8284 768.2332 772.1061 803.3133 808.8709 844.0475 844.6381 846.6733 847.3473 888.4335 888.7341 890.3132 893.5255 950.9670 955.0545 957.4211 962.8004 993.8180 995.2736 996.1571 996.4378 1016.1986 1017.1626 1028.7133 1031.2357 1033.5483 1036.8187 1040.3622 1044.2892 1047.2628 1082.3105 1085.3923 1086.9467 1088.0681 1088.9161 1090.2453 1103.1305 1108.5271 1112.5689 1113.2265 1116.2358 1181.7891 1182.3734 1186.4939 1186.8557 1237.6027 1238.2065 1242.6049 1243.5107 1266.7663 1270.5628 1288.1348 1289.9696 1301.4577 1304.7627 1305.4404 1308.6386 1312.4635 1313.3373 1335.3006 1335.6134 1363.3693 1363.5234 1364.3127 1364.4497 1367.0692 1367.5615 1368.1634 1368.8019 1379.0508 1380.0454 1389.3208 1391.0006 1394.9192 1414.3245 1415.1081 1415.6015 1420.1723 1422.3544 1426.4269 1438.1763 1440.3375 1441.8736 1442.0987 1442.5431 1442.9452 1444.0069 1450.8075 1452.6625 1453.4584 1456.9734 1459.2412 1463.0825 1464.2514 1465.5451 1471.2563 1481.8759 1491.6589 1502.4871 1520.0187 1537.5034 1824.7672 3001.0676 3010.2948 3011.2652 3012.1047 3013.7897 3014.1252 3014.7740 3016.2616 3017.3741 3017.5066 3017.6576 3018.0517 3019.6579 3019.9259 3024.5334 3029.7434 3030.8984 3067.6343 3078.1794 3079.3973 3079.6259 3079.7053 3081.4235 3082.5599 3082.9828 3083.9668 3085.7432 3086.6885 3087.0554 3087.0858 3088.7848 3091.1617 3092.1961 3100.5987 3113.6871 3116.8399 3123.6612 3131.8530 3134.0859
redmass: 3.8024 3.8532 4.4461 4.7050 4.8883 3.9099 4.9114 3.0663 1.2027 3.3451 2.2565 1.7229 2.1673 2.9249 1.4450 1.3865 2.1964 1.4237 3.7835 1.7039 2.9355 3.3533 2.3250 2.2982 2.2641 2.3354 2.4831 2.4474 3.2384 2.5424 2.0958 5.7433 2.1274 4.7299 4.7161 4.6270 4.2281 4.5213 4.1640 1.8954 1.9287 1.9255 1.9519 3.6249 2.9520 2.3486 4.2380 4.1746 2.4483 3.4898 3.8910 3.7466 3.7716 2.6956 3.6195 2.3208 3.3101 1.7009 4.3139 4.3488 4.6604 2.8559 4.1089 4.3624 1.4268 1.4043 1.3498 5.5315 4.2389 2.2194 2.2214 3.3356 3.3233 3.3101 3.3561 1.8286 1.8696 1.8310 1.8177 1.4330 1.5237 4.2178 5.1435 2.3614 2.3503 2.3623 2.3557 3.1452 3.1361 1.4169 1.4132 1.4053 1.4762 1.5076 2.8558 2.8257 1.9248 2.0535 2.9190 2.8965 2.7693 3.0027 1.7817 1.5636 1.5822 1.5950 1.6187 3.5826 3.5161 1.0970 1.0926 1.2630 1.2594 1.2577 1.2481 1.6889 1.8768 2.3945 2.1294 1.8600 1.8007 1.7351 1.6345 1.2847 1.3220 1.2269 1.2282 1.3791 1.3776 1.3747 1.3689 1.2156 1.2238 1.2267 1.2317 1.3829 1.3802 1.2317 1.2359 1.2260 1.0940 1.0970 1.0976 1.0886 1.0801 1.0817 1.7717 1.7224 1.0966 1.1053 1.0968 1.1011 1.2326 1.0593 1.0964 1.0983 1.1206 1.0533 1.0947 1.1134 1.1320 1.1834 1.9725 1.6577 2.7400 4.1912 5.0206 1.0181 1.0600 1.0448 1.0468 1.0572 1.0523 1.0490 1.0555 1.0569 1.0440 1.0590 1.0437 1.0587 1.0587 1.0592 1.0605 1.0633 1.0637 1.1045 1.1058 1.1059 1.1054 1.1059 1.1081 1.1064 1.1074 1.1079 1.0987 1.1081 1.1076 1.0966 1.0952 1.1038 1.0953 1.0946 1.1016 1.1009 1.1012 1.1019 1.0997
irintensity: 0.0034 0.0159 0.1306 0.1081 0.1469 0.1946 0.7601 0.9213 0.1132 1.0857 0.7295 0.0054 0.1210 0.2668 0.5610 0.2224 0.1307 0.0615 4.6172 2.2879 5.8986 6.2709 1.1098 1.4153 1.8096 5.9626 4.8573 4.4018 7.8873 3.0634 0.0316 0.2916 0.0070 0.1996 1.0756 1.7444 4.4600 2.2530 0.9369 1.3873 3.0392 0.6274 0.2858 64.2943 21.6168 0.1775 0.2898 1.4284 51.5518 42.7694 26.6873 28.8249 11.3628 44.6899 4.1736 17.7448 3.7207 14.8459 3.5649 3.5342 0.1899 4.4482 1.7884 5.1018 0.1386 0.5137 38.9188 39.3804 13.5159 0.1009 0.0637 4.3721 30.6833 22.5825 22.9616 7.6220 7.9346 2.0339 4.1011 0.4403 12.7408 102.7028 96.2747 3.6603 62.9397 75.8838 94.9166 0.0502 0.2077 4.1939 3.6501 29.8984 1.1692 1.5500 112.8679 63.4506 8.5533 14.7279 0.8925 12.2464 2.1202 4.1222 0.3475 18.9949 27.3966 27.7182 18.9394 0.2666 2.1176 0.3836 0.3842 4.1267 1.3235 0.5643 1.1817 39.2459 44.3327 49.2765 29.7624 43.3432 31.2063 39.4685 10.5567 3.0952 6.9101 0.0916 0.1119 0.4858 0.4289 0.9506 0.0185 7.4230 7.4791 2.1357 6.2140 1.1029 0.2963 6.5754 8.0762 5.4748 6.9742 14.7984 12.3344 4.0664 7.6804 6.4257 1.5646 1.3840 17.8124 21.8425 35.8625 2.7257 5.4249 1.9400 1.1918 8.1544 3.9368 0.2311 4.8241 7.2548 0.5839 10.9383 7.2008 3.4886 1.4143 7.6347 11.0040 197.2999 40.4767 40.1267 9.2243 32.3584 55.5324 26.2804 30.8036 61.4245 57.1779 77.5394 48.6329 72.6210 26.0226 86.0327 60.2705 90.2390 61.3851 17.0802 0.3231 1.6701 5.2240 3.4334 29.3962 16.5863 28.7467 23.3741 25.6434 40.6611 30.6285 6.0761 13.0731 14.2882 15.0816 7.8214 14.5570 13.5545 16.0395 15.6676 9.6016
temp: 298.150 k
press: 1.00000 atm
elementType: 6 7 6 7 6 7 6 15 6 6 44 15 6 7 6 7 6 7 6 6 6 6 6 6 6 6 1 1 1 1 1 1 1 1 1 1 1 1 1 1 1 1 1 1 1 1 1 1 1 1 1 6 6 6 6 6 1 1 1 1 1 1 1 1 1 1 1 1 1 1 1
symmnumber: 1
zpe: 1607240.0 jmol-1
zpe.correction: 0.612165 hartree
zpe.thermalcorrener: 0.643017 hartree
zpe.thermalcorrenthalpy: 0.643961 hartree
zpe.thermalcorrgfe: 0.553269 hartree
zpe.sumelectzpe: -1967.048077 hartree
zpe.sumelectthermal: -1967.017225 hartree
zpe.sumelectthermalent: -1967.016281 hartree
zpe.sumelectthermalfe: -1967.106973 hartree
dipole: 0.0716 0.6954 1.0510
dipole: 1.2622
quadrupole: -216.0620 -216.6652 -220.7944
quadrupole: -0.2943 0.0125 0.7413
quadrupole: 1.7785 1.1754 -2.9539 -0.2943 0.0125 0.7413
hfenergy: -1967.6602419 hartree
pointgroup: C01 [X(C22H40N6P2Ru1)]
dipole: 0.028152 0.2735794 0.4134833 debye
polarizability: 378.5471823|0.3777976|375.5281498|-0.5472457|1.4563522|283.1336067 unknown
InChI: InChI=1S/C10H15.2C6H12N3P.Ru.H/c1-6-7(2)9(4)10(5)8(6)3;2*1-7-2-9-3-8(1)5-10(4-7)6-9;;/h1-5H3;2*1-6H2;;
charge 0 multiplicity 1
71 atoms
C  -2.922302 -3.349868 -0.232653
N  -3.221734 -2.439244 -1.335053
C  -4.442191 -1.70823 -1.008212
N  -4.388399 -0.997346 0.267503
C  -4.060522 -1.961013 1.314466
N  -2.826388 -2.704657 1.076881
C  -2.111232 -1.523061 -1.593857
P  -1.660979 -0.446172 -0.129534
C  -1.661022 -1.8243 1.148387
C  -3.422862 0.099548 0.227158
Ru 0.010297 1.08274 -0.287638
P  1.599492 -0.5200 -0.124084
C  2.110426 -1.26777 1.521147
N  3.201605 -2.237192 1.412432
C  4.406427 -1.61954 0.862916
N  4.289673 -1.211985 -0.535566
C  3.886137 -2.374702 -1.321247
N  2.657095 -3.011595 -0.854441
C  2.827627 -3.359658 0.555327
C  1.498964 -2.143035 -1.055594
C  3.33912 -0.112063 -0.691776
C  1.18737 2.980292 -0.277644
C  0.91764 2.609424 1.093085
C  -0.491784 2.624034 1.293529
C  -1.107307 3.00967 0.042898
C  -0.070799 3.228991 -0.911547
H  0.020409 0.589918 -1.853197
H  -3.72453 0.821273 -0.545641
H  -3.440232 0.62936 1.191857
H  -0.747483 -2.427728 1.029486
H  -1.60438 -1.359452 2.14622
H  -1.226062 -2.092827 -1.910307
H  -2.364657 -0.85389 -2.429325
H  -4.886632 -2.683184 1.382301
H  -3.984593 -1.43651 2.277165
H  -5.271065 -2.428842 -0.959501
H  -4.65837 -0.990896 -1.811706
H  -1.98009 -3.875018 -0.444617
H  -3.725579 -4.098671 -0.182011
H  3.286273 0.188588 -1.749137
H  3.70131 0.760579 -0.129367
H  1.234788 -1.748967 1.982085
H  2.410738 -0.452194 2.194982
H  0.590357 -2.683666 -0.750054
H  1.388218 -1.909575 -2.125635
H  4.694698 -3.117843 -1.271175
H  3.760239 -2.074811 -2.370535
H  5.226668 -2.347745 0.937082
H  4.67021 -0.743216 1.472015
H  3.619991 -4.118623 0.622982
H  1.895484 -3.804675 0.931922
C  1.948349 2.396766 2.152846
C  -1.195951 2.419859 2.594958
C  -2.544717 3.357456 -0.165228
C  -0.255075 3.731689 -2.304342
C  2.520881 3.295419 -0.873141
H  -1.211162 3.402143 -2.724823
H  -0.234742 4.830688 -2.334674
H  0.535162 3.362998 -2.966707
H  2.605259 2.926666 -1.90215
H  2.695245 4.381013 -0.897582
H  3.341184 2.853518 -0.296552
H  1.564473 1.768729 2.965333
H  2.851701 1.912338 1.759045
H  2.264942 3.351666 2.5960
H  -2.884549 3.094167 -1.174054
H  -3.200664 2.850282 0.549975
H  -2.704943 4.437975 -0.039544
H  -2.221783 2.06119 2.447718
H  -0.680719 1.678926 3.217824
H  -1.261905 3.353006 3.173473
