program: Gaussian 09
title: [CpRu(PTA)2(H)]
version: AM64L-G09RevC.01
frameworkgroup: C1[X(C17H30N6P2Ru)]
method: RM06
basis: Gen
operation: Freq
keyword: #pm06
keyword: integral=grid=ultrafine
keyword: gen
keyword: pseudo=read
keyword: scfcyc=60
keyword: freq
title: #p m06 integral=grid=ultrafine gen pseudo=read scfcyc=60 freq
basis: NPDir=0 NMtPBC= 1 NCelOv= 1 NCel= 1 NClECP= 1 NCelD= 1
basis: NCelK= 1 NCelE2= 1 NClLst= 1 CellRange= 0.0.
basis: One-electron integrals computed using PRISM.
basis: 1 Symmetry operations used in ECPInt.
basis: ECPInt: NShTT= 21528 NPrTT= 106151 LenC2= 18369 LenP2D= 55341.
basis: LDataN: DoStor=T MaxTD1= 7 Len= 274
basis: NBasis= 551 RedAO= T NBF= 551
basis: NBsUse= 551 1.00D-06 NBFU= 551
converged: YES YES NO YES
title: Mulliken atomic charges:
elementType: C C C C C Ru P C N C N C N C C C P C N C N C N C C C H H H H H H H H H H H H H H H H H H H H H H H H H H H H H H
charge: -0.172177 -0.152182 -0.154584 -0.173975 -0.123732 -0.568574 0.588737 -0.245340 -0.377043 0.002625 -0.376399 0.004398 -0.375261 0.005993 -0.255171 -0.239404 0.589071 -0.244816 -0.376788 0.003282 -0.377637 0.004442 -0.376303 0.006174 -0.257308 -0.236942 0.062446 0.142531 0.138349 0.103100 0.143190 0.131946 0.155571 0.128778 0.124893 0.127954 0.127562 0.119620 0.129198 0.153362 0.134310 0.131144 0.134915 0.105735 0.155588 0.128760 0.129448 0.128699 0.124377 0.129874 0.119834 0.126420 0.132735 0.128925 0.146437 0.133211
chargesum: 0.00000
title: Mulliken charges with hydrogens summed into heavy atoms:
elementType: C C C C C Ru P C N C N C N C C C P C N C N C N C C C
charge: -0.038966 -0.025762 -0.021849 -0.045050 0.022705 -0.506128 0.588737 0.015984 -0.377043 0.260834 -0.376399 0.257473 -0.375261 0.255701 0.032501 0.026655 0.589071 0.042702 -0.376788 0.258798 -0.377637 0.258113 -0.376303 0.254993 0.023572 0.009348
polarizability: 3.27927106e+02 3.92575309e-01 3.05522556e+02 -6.53138334e-01 2.10530111e+00 2.28771614e+02
1716.lowfreq: -6.3310 -3.6246 -0.0017 -0.0007 -0.0004 7.3744 27.3312 36.0866 44.9951
frequency: 27.0346 36.0358 44.9809 53.8123 67.7666 81.7844 112.9618 139.6204 140.5219 177.7598 202.3781 222.4728 268.2555 274.2218 277.6734 284.2692 328.0533 341.2190 362.6394 371.1433 383.8548 394.1723 395.6597 397.2503 398.3893 460.5291 461.8251 462.8224 464.9005 495.7926 503.8284 584.2133 586.3545 587.1473 588.3045 588.9815 590.5231 592.9519 601.8875 637.6069 660.1003 662.0603 725.0586 733.6035 739.3099 743.6047 754.9502 756.3649 760.4092 766.5827 769.5984 792.8883 796.3990 815.2483 821.0006 830.4609 843.6935 844.0217 844.7696 845.6306 887.5134 889.1057 890.0444 892.3245 894.0745 894.7590 956.3306 962.3313 993.7329 994.4847 995.6385 995.9403 1003.6224 1014.2341 1015.9647 1021.0975 1043.4731 1045.9915 1057.4051 1061.4208 1086.3688 1087.1412 1087.7594 1088.9050 1108.7306 1111.9849 1113.6626 1115.1230 1130.4986 1186.0710 1187.9483 1240.5059 1242.2463 1242.6261 1245.7458 1258.5170 1267.0532 1269.7695 1289.3379 1290.5285 1301.7650 1303.8646 1305.6889 1309.3199 1311.6847 1313.5678 1335.1174 1335.8374 1363.2854 1363.4468 1364.0351 1364.3797 1367.3023 1367.4043 1368.0055 1368.7355 1398.7275 1401.3890 1416.3540 1417.7942 1420.0502 1423.1444 1425.1833 1428.3807 1442.4286 1442.6049 1442.8045 1443.0038 1444.0833 1458.4757 1464.1451 1464.6028 1878.3350 2999.3014 3005.9648 3009.3611 3010.7285 3010.9020 3014.4969 3018.6112 3018.9539 3021.0745 3021.7837 3030.5674 3031.2714 3063.6419 3071.4115 3072.7791 3075.7233 3076.1538 3078.1722 3082.1798 3082.6341 3085.5345 3086.1098 3087.9467 3089.0555 3218.4780 3230.7296 3242.1700 3245.3929 3257.0786
redmass: 4.1996 3.5851 5.1706 4.5040 5.1912 5.1933 4.9090 5.0104 4.9674 4.9536 5.2918 6.6350 2.2763 2.4432 2.4313 2.5589 8.2487 6.0959 2.1031 2.1304 4.8460 4.6901 4.7188 4.6408 4.6137 1.9064 1.9349 1.9339 1.9521 3.2647 2.7197 3.3949 3.9236 3.7169 3.7700 3.5007 3.1943 4.2278 2.7478 1.1968 4.4380 4.5353 1.7643 4.2668 4.2476 4.2642 1.4737 1.7849 1.3992 5.5015 5.2214 1.1802 1.2122 1.3552 3.4855 2.9103 3.4178 3.3592 3.3636 3.3504 1.3561 1.4542 1.7928 1.5428 1.6258 1.6203 5.1911 5.2591 2.3654 2.3602 2.3700 2.3655 1.4674 3.1404 3.1711 1.3949 2.8800 2.8771 1.1723 1.1450 2.9596 2.9494 2.9705 2.9888 1.5702 1.5765 1.5956 1.6281 5.3257 1.0885 1.0866 1.2648 1.2567 1.2675 1.2537 1.2783 1.8202 1.9562 2.1816 2.0450 1.8461 1.8207 1.6947 1.6253 1.3031 1.2947 1.2242 1.2310 1.3733 1.3699 1.3731 1.3707 1.2186 1.2237 1.2237 1.2332 5.2231 5.2049 1.0968 1.0920 1.0922 1.0879 1.0798 1.0808 1.0950 1.0981 1.1212 1.1022 2.5725 2.8101 1.1112 1.1134 1.0175 1.0593 1.0594 1.0594 1.0594 1.0591 1.0597 1.0589 1.0591 1.0588 1.0588 1.0631 1.0632 1.1056 1.1054 1.1059 1.1063 1.1063 1.1060 1.1082 1.1081 1.1082 1.1083 1.1083 1.1084 1.0895 1.0888 1.0955 1.0981 1.1054
irintensity: 0.0102 0.0211 0.0230 0.0043 0.3322 0.1504 0.5099 1.5504 1.5793 4.5611 3.7188 6.2140 0.6544 3.3929 3.4438 3.2892 2.2304 12.9700 0.0202 0.0445 3.3403 0.3181 2.9331 1.6720 1.9807 1.6946 3.2896 0.7746 0.3518 64.7880 13.5258 19.2269 29.0067 25.1239 23.0887 35.6831 41.4166 14.7535 38.8381 36.8705 6.5146 5.1870 14.6594 0.2818 3.2304 4.3561 8.5028 19.6858 0.2224 41.9999 16.3090 49.4695 4.6412 4.0085 4.1727 19.7730 8.8230 19.1794 28.2969 24.0511 3.9265 4.4106 6.3877 3.2944 1.5445 2.1114 128.3240 76.7638 5.1695 56.1341 72.3775 112.1408 12.0362 0.2241 0.4317 5.7615 113.4269 55.9051 0.0314 0.4079 3.5095 6.3520 10.9362 5.1129 21.7774 29.7983 43.9686 13.7383 8.7427 0.1490 0.6632 2.0579 0.6076 1.0409 0.5104 0.0554 51.0363 35.3803 42.2096 26.7844 37.0083 27.3596 40.2033 14.3938 3.0104 5.6092 0.0287 0.0705 0.4218 0.2462 1.0230 0.2744 8.5488 5.7900 2.4800 6.8348 0.2492 0.4912 14.8352 1.3085 7.5384 8.4019 4.4906 6.3372 28.1312 25.8604 14.4164 11.1179 3.5888 1.2326 5.1998 3.3949 169.7504 50.5707 16.4013 22.7546 20.8650 32.5697 21.4451 55.3429 69.4770 55.2357 61.3052 126.1658 61.9570 15.8612 2.7517 13.4175 7.4590 9.8041 5.5114 44.6889 1.1048 16.4394 19.0240 38.2814 35.3345 3.9785 1.0628 7.1687 6.8206 6.5979
temp: 298.150 k
press: 1.00000 atm
elementType: 6 6 6 6 6 44 15 6 7 6 7 6 7 6 6 6 15 6 7 6 7 6 7 6 6 6 1 1 1 1 1 1 1 1 1 1 1 1 1 1 1 1 1 1 1 1 1 1 1 1 1 1 1 1 1 1
symmnumber: 1
zpe: 1245614.7 jmol-1
zpe.correction: 0.474430 hartree
zpe.thermalcorrener: 0.496928 hartree
zpe.thermalcorrenthalpy: 0.497872 hartree
zpe.thermalcorrgfe: 0.423162 hartree
zpe.sumelectzpe: -1770.750174 hartree
zpe.sumelectthermal: -1770.727675 hartree
zpe.sumelectthermalent: -1770.726731 hartree
zpe.sumelectthermalfe: -1770.801441 hartree
dipole: 0.0369 -0.6634 0.8938
dipole: 1.1137
quadrupole: -181.3498 -190.1169 -188.1572
quadrupole: -0.4217 -0.0220 0.2574
quadrupole: 5.1915 -3.5756 -1.6159 -0.4217 -0.0220 0.2574
hfenergy: -1771.2246034 hartree
pointgroup: C01 [X(C17H30N6P2Ru1)]
dipole: 0.0145098 -0.2609856 0.3516484 debye
polarizability: 327.9271064|0.3925744|305.5225556|-0.6531382|2.1053011|228.7716137 unknown
InChI: InChI=1S/2C6H12N3P.C5H5.Ru.H/c2*1-7-2-9-3-8(1)5-10(4-7)6-9;1-2-4-5-3-1;;/h2*1-6H2;1-5H;;
charge 0 multiplicity 1
56 atoms
C  1.131138 3.447898 -0.253629
C  0.889987 3.069728 1.110994
C  -0.509213 3.056815 1.333344
C  -1.147278 3.414683 0.097104
C  -0.136154 3.665126 -0.86796
Ru 0.008892 1.513849 -0.255516
P  1.628869 -0.029292 -0.081899
C  1.599677 -1.645296 -1.020242
N  2.798357 -2.455849 -0.812935
C  3.998553 -1.754166 -1.266618
N  4.345395 -0.580861 -0.467943
C  4.47136 -0.997403 0.927061
N  3.289105 -1.669051 1.462959
C  2.972499 -2.802901 0.596921
C  3.347285 0.477541 -0.619133
C  2.155617 -0.74894 1.566638
P  -1.642855 -0.007223 -0.093464
C  -2.151612 -1.052583 -1.557455
N  -3.293867 -1.924098 -1.282621
C  -4.476462 -1.147134 -0.919676
N  -4.368046 -0.452818 0.362547
C  -4.050219 -1.440119 1.391321
N  -2.85205 -2.230054 1.115044
C  -3.00599 -2.858125 -0.197026
C  -3.364561 0.60939 0.309591
C  -1.650859 -1.398021 1.166224
H  0.031762 1.01718 -1.806002
H  -3.651399 1.346919 -0.454544
H  -3.331968 1.137378 1.274913
H  -0.763236 -2.032166 1.009314
H  -1.548775 -0.951548 2.167821
H  -1.292508 -1.656594 -1.885293
H  -2.389882 -0.371424 -2.387429
H  -4.901304 -2.130926 1.473415
H  -3.929526 -0.929578 2.356744
H  -5.331807 -1.835101 -0.860544
H  -4.681345 -0.413018 -1.710713
H  -2.090753 -3.418079 -0.436786
H  -3.837705 -3.574029 -0.133681
H  3.294572 0.798822 -1.670025
H  3.649138 1.355847 -0.028026
H  1.30061 -1.266196 2.026978
H  2.415963 0.085755 2.235492
H  0.712579 -2.226126 -0.720603
H  1.483747 -1.413905 -2.089999
H  4.841101 -2.458533 -1.219673
H  3.863048 -1.450822 -2.313597
H  5.319113 -1.693486 0.998529
H  4.697183 -0.118534 1.546546
H  3.797495 -3.525707 0.668293
H  2.057927 -3.291058 0.962946
H  1.65278 2.856153 1.852487
H  -1.006979 2.839019 2.270641
H  -2.214073 3.520119 -0.06142
H  -0.300771 3.956707 -1.897685
H  2.098672 3.59147 -0.719042
