program: Gaussian 09
title: (THF)2-H+
version: AS64L-G09RevD.01
frameworkgroup: C1[X(C8H17O2)]
method: RM06
basis: Gen
operation: Freq
keyword: #P
keyword: Geom=AllCheck
keyword: Guess=TCheck
keyword: SCRF=Check
keyword: GenChk
keyword: RM06/ChkBas
keyword: Freq
converged: YES YES NO NO
title: Mulliken charges:
elementType: C C C O C H H H H H H H H H O C C H H C H H C H H H H
charge: -0.299394 -0.302260 -0.020437 -0.603594 -0.018151 0.184354 0.191130 0.183573 0.172544 0.193022 0.162986 0.188361 0.171097 0.594145 -0.604547 -0.020331 -0.302539 0.165706 0.187780 -0.299010 0.172776 0.193000 -0.017558 0.190901 0.183605 0.168401 0.184443
chargesum: 1.00000
title: Mulliken charges with hydrogens summed into heavy atoms:
elementType: C C C O C O C C C C
charge: 0.075309 0.063305 0.330910 -0.009450 0.337300 -0.604547 0.333154 0.063236 0.075496 0.335286
polarizability: 1.03367449e+02 -3.33309421e-01 8.87994229e+01 1.73178896e-01 3.84852245e-01 7.72920886e+01
1716.lowfreq: -11.7694 -7.6250 -0.0010 -0.0008 0.0005 8.2191 23.2724 33.0794 60.0536
frequency: 17.2503 32.7552 59.9721 61.4410 152.9506 158.2309 161.7054 266.2330 268.2972 400.2332 560.7990 562.5657 626.9558 707.0366 833.2900 836.2865 855.1051 859.6212 860.8710 917.7191 919.3702 939.7761 940.9262 953.8621 962.6763 970.1771 1031.0445 1033.9145 1051.1497 1056.3668 1146.7074 1150.3270 1176.5239 1188.5600 1191.7627 1205.2858 1246.6379 1250.9310 1254.1809 1262.4805 1265.1276 1310.0561 1311.3366 1332.4353 1350.6872 1356.5661 1367.9658 1369.4574 1387.8540 1451.3863 1459.9795 1461.0043 1467.0674 1479.1108 1480.5317 1482.3732 1494.3732 1575.4000 1758.0093 3046.5954 3047.8745 3064.6052 3065.9992 3071.0633 3071.8825 3074.3800 3075.5184 3138.3649 3138.6749 3142.8888 3143.7448 3147.2502 3147.9451 3151.7353 3152.5786
redmass: 2.7525 2.9288 3.0804 3.1224 3.1921 2.4816 2.9960 1.5995 1.6036 4.9795 1.7279 1.7649 3.2233 2.4101 1.5090 4.2839 1.7091 2.1902 2.1228 1.4925 1.4563 2.3895 2.3529 3.7759 1.7289 1.8252 3.6172 4.2195 1.4983 1.4996 1.7735 1.7944 1.3083 1.3367 1.4056 1.4567 1.1572 1.1585 1.1122 1.2253 1.2224 1.3495 1.3480 1.2364 1.3776 1.3673 1.3918 1.3740 1.3854 1.0927 1.0954 1.0959 1.1016 1.1593 1.0957 1.0942 1.1113 1.1424 1.0628 1.0655 1.0657 1.0686 1.0685 1.0593 1.0595 1.0639 1.0639 1.1080 1.1081 1.1034 1.1034 1.1048 1.1051 1.1063 1.1062
irintensity: 0.2717 0.1230 0.0018 0.0616 0.8772 2.5999 1.3209 0.8315 0.3064 0.0497 3.5479 0.4713 65.3668 0.0109 231.7477 295.6638 0.2274 34.2303 0.2405 2.8556 9.1192 2.9492 1.1285 0.0458 14.1088 0.0198 149.5900 0.5615 8.4761 0.2908 5.1238 0.1130 46.0129 43.1599 0.0412 0.1277 121.0108 175.7821 540.2001 21.2358 24.2212 4.1906 3.8040 613.2167 0.5772 198.7339 3.0576 21.4913 0.9087 600.1912 9.7880 13.6156 0.9730 132.0012 5.7892 10.0468 0.3609 2392.3969 24.5556 8.2186 31.2672 3.4668 3.2799 4.7329 26.1056 11.0162 12.0005 2.7168 3.9444 2.4342 2.5549 0.9217 2.6493 9.5372 6.5702
temp: 298.150 k
press: 1.00000 atm
elementType: 6 6 6 8 6 1 1 1 1 1 1 1 1 1 8 6 6 1 1 6 1 1 6 1 1 1 1
symmnumber: 1
zpe: 645826.8 jmol-1
zpe.correction: 0.245982 hartree
zpe.thermalcorrener: 0.257037 hartree
zpe.thermalcorrenthalpy: 0.257981 hartree
zpe.thermalcorrgfe: 0.206264 hartree
zpe.sumelectzpe: -464.722836 hartree
zpe.sumelectthermal: -464.711781 hartree
zpe.sumelectthermalent: -464.710837 hartree
zpe.sumelectthermalfe: -464.762554 hartree
dipole: -0.0055 -0.0429 0.0000
dipole: 0.0432
quadrupole: -25.0100 -49.1796 -58.5823
quadrupole: 0.0645 -0.1317 0.9376
quadrupole: 19.2473 -4.9223 -14.3250 0.0645 -0.1317 0.9376
hfenergy: -464.9688183 hartree
pointgroup: C01 [X(C8H17O2)]
dipole: 0.0022819 0.0166438 0.002669 debye
polarizability: 103.2421281|-0.1747115|88.605369|-1.8195821|1.5397857|77.6114632 unknown
InChI: InChI=1S/C8H17O2/c1-2-6-9(5-1)11-10-7-3-4-8-10/h1-8H2
charge 1 multiplicity 1
27 atoms
C  3.29126518 -0.67149726 -0.1813121
C  3.10985953 0.70359177 0.45601616
C  1.83875655 1.19941901 -0.19720768
O  1.0509325 -0.01960054 -0.44023202
C  1.87916114 -1.21017241 -0.20085492
H  1.6615326 -1.91760537 -1.00444419
H  3.96660194 -1.32080888 0.38119974
H  3.67995421 -0.57984883 -1.20231091
H  2.9776033 0.61262215 1.54093993
H  3.9513431 1.37623187 0.27274099
H  1.23012954 1.86525132 0.42368745
H  2.00722467 1.66062112 -1.17516631
H  1.57856899 -1.63330456 0.76714544
H  -0.00815498 -0.03962535 0.10764672
O  -1.06750438 -0.074185 0.65878175
C  -1.88446316 -1.25165624 0.32327683
C  -3.16003374 -0.67517301 -0.25038768
H  -1.30364796 -1.86755367 -0.37151741
H  -2.03986922 -1.79829847 1.25846513
C  -3.29646175 0.64183148 0.509196
H  -3.05233098 -0.49165985 -1.32625139
H  -4.01113933 -1.34494051 -0.10491127
C  -1.87296418 1.14860852 0.53730311
H  -3.97166996 1.35079231 0.02381085
H  -3.66075043 0.46835754 1.52860791
H  -1.58747542 1.64344259 -0.40087645
H  -1.62066881 1.78345348 1.38993817
