program: Gaussian 09
title: 000032021
version: EM64L-G09RevD.01
frameworkgroup: C1[X(C10H15N5O)]
method: RPBEPBE
basis: SDD
operation: Freq
keyword: #p
keyword: freq=noraman
keyword: PBEPBE/SDD
title: #p freq=noraman PBEPBE/SDD
converged: YES YES NO NO
title: Mulliken charges:
elementType: O N N N N N C C C C C C C C C C H H H H H H H H H H H H H H H
charge: -0.477161 -0.375209 -0.402119 -0.093881 -0.023378 0.027531 -0.008626 -0.375597 -0.432122 -0.385277 -0.723766 0.236116 0.095280 -0.086230 -0.225618 -0.393502 0.197923 0.242731 0.182348 0.275630 0.218915 0.187858 0.254094 0.201706 0.242517 0.207120 0.275540 0.303165 0.348715 0.263519 0.241776
chargesum: 0.00000
title: Mulliken charges with hydrogens summed into heavy atoms:
elementType: O N N N N N C C C C C C C C C C
charge: -0.128446 -0.099669 -0.098954 -0.093881 -0.023378 0.027531 0.189297 0.049481 0.062424 0.056675 -0.072422 0.236116 0.095280 -0.086230 0.037901 -0.151726
polarizability: 1.86726286e+02 1.92540625e+00 1.53974708e+02 2.34155641e+01 -3.25263274e+00 9.86738858e+01
1716.lowfreq: -1.4705 -0.0009 -0.0009 -0.0006 7.5570 14.8621 31.3446 35.0381 43.1582
frequency: 29.3478 34.7381 43.1491 81.4758 113.4734 155.7911 165.2456 207.0066 214.1206 246.0272 251.8730 262.6843 289.1500 308.9274 359.2126 386.2295 421.6471 470.9653 524.8597 535.1160 557.0387 562.7265 575.5131 612.5284 640.4282 670.8389 718.0491 754.1110 786.6495 827.7054 827.8375 850.2817 888.3376 904.0763 927.3974 929.3633 949.4835 959.3017 996.1052 1027.5414 1075.2654 1081.5751 1104.1533 1110.4272 1135.1821 1150.0118 1179.3705 1216.8710 1231.7918 1238.1139 1268.3120 1280.2367 1300.1451 1306.9000 1332.2974 1336.1965 1339.1985 1353.1043 1362.4454 1379.1156 1380.7081 1410.4739 1426.7206 1428.5941 1451.1156 1466.0910 1471.4813 1486.1078 1487.1930 1499.8590 1521.3780 1611.8690 2943.7007 2963.5634 2971.6435 2978.5615 2988.9450 3006.7544 3046.2426 3066.5008 3086.6172 3100.0792 3158.2169 3233.1895 3561.1712 3584.4384 3585.9172
redmass: 4.2825 4.3856 5.6094 4.7873 5.5030 3.2776 3.3793 1.1662 5.8746 1.4793 1.6702 3.2943 3.2615 3.0300 2.6472 1.9167 1.3526 4.3027 3.2946 4.4872 1.5544 3.9862 2.9165 2.4364 7.1643 7.0417 4.8542 2.7789 5.7257 1.8190 2.8469 2.4200 2.3900 7.5326 2.3636 1.4330 2.1977 1.6389 1.8759 2.5218 2.1512 2.1528 1.9196 3.7761 2.2020 1.7045 1.3512 1.3195 1.7877 1.3144 1.3051 5.1641 2.0075 2.0975 2.3120 1.8595 1.8597 1.4901 1.6030 1.9335 1.2234 1.3341 2.9149 1.9688 1.1291 1.0966 1.0649 1.7623 1.1352 1.1203 6.4773 6.2243 1.0579 1.0662 1.0647 1.0515 1.0699 1.1066 1.0953 1.0993 1.0994 1.0931 1.0917 1.0987 1.0767 1.0666 1.0819
irintensity: 3.1416 0.6316 4.9462 7.1135 3.2586 3.2254 1.6321 0.9291 6.7470 81.3256 65.7848 16.4080 1.1800 1.8237 5.0720 4.5636 56.7391 9.5827 6.6154 1.3259 177.8844 9.6065 8.1621 5.0990 8.7592 4.8184 2.5213 9.7039 0.8324 26.5319 18.1111 11.1353 0.9503 1.2172 63.4210 14.3815 3.8034 17.1572 10.1252 20.1985 21.5643 6.5554 14.3447 22.0911 1.3773 8.1381 2.2385 41.1170 20.4202 62.6007 2.6449 2.8376 24.0838 23.6266 7.4995 9.8052 92.0703 7.5422 42.4241 54.5252 11.0846 5.2359 70.8296 4.1613 8.5623 14.2530 15.6444 6.8433 13.0997 25.2902 123.6258 459.6452 44.4501 36.0078 38.6640 49.1924 63.6664 32.5272 23.9817 45.1897 28.9435 4.8194 20.8871 1.4951 27.2682 4.2867 35.3501
temp: 298.150 k
press: 1.00000 atm
elementType: 8 7 7 7 7 7 6 6 6 6 6 6 6 6 6 6 1 1 1 1 1 1 1 1 1 1 1 1 1 1 1
symmnumber: 1
zpe: 662517.0 jmol-1
zpe.correction: 0.252339 hartree
zpe.thermalcorrener: 0.267678 hartree
zpe.thermalcorrenthalpy: 0.268622 hartree
zpe.thermalcorrgfe: 0.208565 hartree
zpe.sumelectzpe: -737.827080 hartree
zpe.sumelectthermal: -737.811741 hartree
zpe.sumelectthermalent: -737.810797 hartree
zpe.sumelectthermalfe: -737.870855 hartree
dipole: 2.5002 -5.9516 1.1950
dipole: 6.5651
quadrupole: -117.3210 -80.7392 -96.7814
quadrupole: 24.0091 -5.2953 -0.8123
quadrupole: -19.0405 17.5413 1.4992 24.0091 -5.2953 -0.8123
hfenergy: -738.0794192 hartree
pointgroup: C01 [X(C10H15N5O1)]
dipole: 1.096659 1.3243579 -1.9273872 debye
polarizability: 179.9130898|-24.7644568|132.4239865|-21.8790738|-24.5888515|127.0378035 unknown
InChI: InChI=1S/C10H15N5O/c1-7(4-16)2-3-11-9-8-10(13-5-12-8)15-6-14-9/h5-7,11-12,16H,2-4H2,1H3
charge 0 multiplicity 1
31 atoms
O  4.323915 -1.505166 0.697786
N  0.468274 0.115713 -1.356794
N  -2.262584 1.697485 -0.850732
N  -0.26399 -1.211029 0.472519
N  -3.711363 1.079426 0.811194
N  -2.381458 -0.838899 1.667154
C  3.178538 0.57797 0.174993
C  2.995925 0.116594 -1.29404
C  1.697923 -0.672377 -1.581425
C  3.227937 -0.618043 1.145263
C  4.443659 1.456741 0.314478
C  -0.47173 -0.160487 -0.38304
C  -1.674464 0.591745 -0.21623
C  -2.593187 0.218384 0.816836
C  -3.474899 1.938194 -0.19038
C  -1.21384 -1.486412 1.427088
H  2.291859 1.178549 0.470003
H  3.849253 -0.533866 -1.56421
H  3.043488 1.005052 -1.958694
H  1.624817 -1.562409 -0.937782
H  1.707669 -1.021056 -2.633422
H  3.427029 -0.246182 2.173359
H  2.259675 -1.158036 1.141879
H  4.418712 2.311297 -0.387572
H  5.347625 0.858299 0.104169
H  4.535283 1.862306 1.339399
H  0.322726 0.929442 -1.954739
H  -1.902639 2.231927 -1.639727
H  4.371389 -2.290818 1.296412
H  -4.139293 2.749123 -0.482558
H  -0.990448 -2.340968 2.073413
