program: Gaussian 09
title: 000032035
version: EM64L-G09RevD.01
frameworkgroup: C1[X(C17H23NOS)]
method: RPBEPBE
basis: SDD
operation: Freq
keyword: #p
keyword: freq=noraman
keyword: PBEPBE/SDD
title: #p freq=noraman PBEPBE/SDD
converged: YES YES NO NO
title: Mulliken charges:
elementType: S O N C C C C C C C C C C C C C C C C C H H H H H H H H H H H H H H H H H H H H H H H
charge: 0.160217 -0.236072 -0.320453 -0.027592 -0.576252 -0.497681 -0.750256 0.502956 0.324513 -0.423457 -0.398015 -0.405316 0.405324 -0.373747 -0.806761 -0.228943 -0.232248 -0.244116 -0.586810 -0.657452 0.196787 0.214446 0.227526 0.266399 0.202436 0.223120 0.209847 0.222002 0.245052 0.234619 0.228748 0.257527 0.258736 0.267856 0.271207 0.223155 0.222202 0.226502 0.243283 0.249849 0.229692 0.231914 0.219254
chargesum: 0.00000
title: Mulliken charges with hydrogens summed into heavy atoms:
elementType: S O N C C C C C C C C C C C C C C C C C
charge: 0.160217 -0.236072 -0.054054 0.169195 -0.134281 -0.072126 -0.073354 0.502956 0.324513 -0.188838 -0.169267 -0.147789 0.405324 -0.115011 -0.267698 -0.005788 -0.010046 -0.017614 -0.093677 0.023409
polarizability: 2.93442666e+02 -1.34640400e+01 2.13425722e+02 3.24423677e+00 -6.75680174e+00 1.45016754e+02
1716.lowfreq: -10.9779 -5.2239 -0.0022 -0.0012 -0.0009 1.9321 7.7587 10.4952 19.3507
frequency: 4.8093 10.0570 19.1307 23.5791 33.4506 39.6420 56.8649 68.7574 86.6799 91.1218 115.2437 151.8211 190.2561 215.5794 223.7777 241.0643 242.7473 253.5227 298.0192 342.2992 344.9964 361.0753 372.8262 403.7414 408.7727 463.4785 500.5097 562.9215 594.3146 602.1246 618.1916 625.8570 635.8044 673.1545 704.5472 714.2646 741.6832 754.2505 788.8652 807.9441 821.4758 843.8721 851.1836 853.7047 867.7303 884.9329 911.9981 918.3198 939.3064 944.0148 973.0450 981.1234 989.7025 991.8732 997.6403 1023.1719 1026.5948 1031.5974 1042.8012 1051.5039 1066.3238 1096.5345 1099.7496 1123.0781 1159.6146 1170.9704 1184.2444 1186.7575 1205.7895 1207.7772 1220.9596 1226.4803 1240.6591 1244.7212 1257.7918 1277.5350 1290.7758 1314.0274 1325.0638 1337.7971 1353.5935 1365.6891 1381.3379 1382.2538 1396.2258 1437.7618 1438.1815 1451.8255 1458.9464 1462.6308 1470.9674 1472.8540 1475.2446 1480.7105 1483.2820 1484.0146 1555.4787 1591.0028 1598.0705 1613.5565 2842.5672 2860.7477 2976.2063 2984.8184 2991.2264 3000.2591 3000.5671 3022.9761 3053.7951 3062.1893 3066.6287 3078.7863 3094.3510 3094.5618 3097.6907 3110.4692 3115.9260 3130.0992 3141.1577 3160.3746 3216.1091 3235.4679 3460.6671
redmass: 3.7974 4.5623 3.5706 3.9291 3.8446 3.1554 2.6224 4.4247 4.0419 4.0848 3.4312 4.3552 2.9292 3.1995 1.7209 1.1151 1.9804 2.8424 3.7406 2.5131 3.9871 2.6624 2.8924 2.8227 2.7611 3.0076 2.7772 1.6740 5.5743 4.4630 6.2424 4.0775 3.5280 4.8933 1.8145 4.4548 2.5457 2.7344 1.1173 1.2906 3.5964 2.0840 1.3492 1.8314 1.4246 1.4181 1.8119 1.6664 5.2824 2.4810 1.3890 1.9822 5.8586 1.3304 1.8103 1.2613 2.1849 1.2081 1.5734 3.7565 2.2471 1.5273 1.2992 2.8777 1.8268 1.0537 1.7770 1.1901 1.7574 1.8672 1.8886 1.3566 1.3098 1.4276 2.4522 1.3375 1.3155 1.3036 1.2936 1.3052 2.4668 1.5207 6.5169 1.2973 1.2039 1.1484 2.0131 1.2124 1.0881 1.1100 1.0391 1.0789 1.0712 1.0815 2.2367 1.0480 8.6776 6.0278 6.6539 6.1619 1.0814 1.0717 1.0364 1.0354 1.0609 1.0816 1.0595 1.0569 1.1011 1.1063 1.0994 1.0988 1.0983 1.1043 1.1068 1.0869 1.0864 1.0909 1.0959 1.1014 1.0940 1.1041 1.0755
irintensity: 0.1673 0.0148 0.4456 1.2254 1.7732 0.3553 0.2087 2.3303 0.3321 0.3430 0.8851 0.6400 0.3823 3.0054 2.9352 0.1846 1.4044 2.1145 2.1811 1.6812 0.6654 4.3861 10.5182 0.0440 2.1823 1.0405 20.4103 110.0471 0.5945 1.3887 0.2439 0.5689 24.6328 10.3491 48.1342 4.6909 32.2330 22.9089 9.8705 59.1959 2.4312 4.0097 0.6977 2.2357 0.3794 1.5317 6.7109 2.4778 4.1905 9.4421 0.1426 11.9882 0.0252 0.1531 19.1195 32.7882 8.0109 1.1095 2.5846 14.8931 9.4174 7.8350 4.2417 22.4958 92.7633 0.2436 6.2395 3.1424 13.4670 3.2725 18.7413 31.6877 3.1036 4.1146 15.1456 4.0172 7.4495 9.0379 20.3778 51.3750 1.5307 0.1021 0.5315 25.4405 17.8022 4.6376 6.9786 27.3819 5.6531 4.4512 14.6839 4.2187 5.8134 6.0011 20.2479 7.5764 13.9768 1.4996 1.7186 12.2443 69.4145 104.9753 28.7855 38.8335 30.5379 13.6163 51.4209 17.9076 14.6113 6.8618 36.8043 34.2438 32.6477 47.3423 5.0159 13.1688 5.3243 12.3634 47.2761 26.9416 7.9890 0.5037 0.3387
temp: 298.150 k
press: 1.00000 atm
elementType: 16 8 7 6 6 6 6 6 6 6 6 6 6 6 6 6 6 6 6 6 1 1 1 1 1 1 1 1 1 1 1 1 1 1 1 1 1 1 1 1 1 1 1
symmnumber: 1
zpe: 943382.6 jmol-1
zpe.correction: 0.359315 hartree
zpe.thermalcorrener: 0.381058 hartree
zpe.thermalcorrenthalpy: 0.382002 hartree
zpe.thermalcorrgfe: 0.300973 hartree
zpe.sumelectzpe: -1188.102628 hartree
zpe.sumelectthermal: -1188.080886 hartree
zpe.sumelectthermalent: -1188.079942 hartree
zpe.sumelectthermalfe: -1188.160971 hartree
dipole: 0.6491 1.2098 -0.5986
dipole: 1.4978
quadrupole: -112.5704 -117.3092 -128.4629
quadrupole: -3.1665 -9.2985 0.8375
quadrupole: 6.8771 2.1383 -9.0154 -3.1665 -9.2985 0.8375
hfenergy: -1188.4619439 hartree
pointgroup: C01 [X(C17H23N1O1S1)]
dipole: 0.2685377 0.4509454 -0.2679018 debye
polarizability: 292.6246448|-15.4533665|212.9526522|4.0569312|-11.6057031|146.3078442 unknown
InChI: InChI=1S/C17H23NOS/c1-3-20-13-17-10-9-16(19-17)12-18-14(2)11-15-7-5-4-6-8-15/h4-10,14,18H,3,11-13H2,1-2H3
charge 0 multiplicity 1
43 atoms
S  5.336991 -0.999956 0.477055
O  2.386529 0.693674 -0.624516
N  -0.337042 0.661433 0.890507
C  -1.801914 0.456302 0.970565
C  -2.262972 -0.525651 -0.156908
C  0.124429 1.620183 -0.137999
C  -2.161348 -0.083559 2.367504
C  -3.773747 -0.618767 -0.295239
C  1.613464 1.77615 -0.152683
C  -4.488827 -1.751114 0.173637
C  -4.511584 0.445602 -0.879621
C  2.459617 2.822623 0.188719
C  3.742347 1.091655 -0.565404
C  3.814017 2.387761 -0.071827
C  4.753419 0.094078 -0.992554
C  -5.896765 -1.821591 0.063249
C  -5.918362 0.382126 -0.990872
C  -6.617719 -0.753357 -0.51832
C  6.40175 -2.215021 -0.520126
C  7.054596 -3.22282 0.437569
H  -2.351174 1.421252 0.817118
H  -1.822997 -0.183824 -1.113719
H  -1.819922 -1.514538 0.061962
H  0.089171 0.850262 1.806359
H  -0.312711 2.642181 -0.00647
H  -0.215977 1.259273 -1.128192
H  -1.911656 0.652479 3.155255
H  -1.599927 -1.014841 2.571037
H  -3.239895 -0.303621 2.435947
H  -3.935341 -2.585138 0.622872
H  -3.976135 1.324592 -1.261503
H  2.148097 3.790859 0.576452
H  4.727602 2.956042 0.090966
H  5.64692 0.596897 -1.396613
H  4.331984 -0.586645 -1.751181
H  -6.429007 -2.70806 0.427219
H  -6.468656 1.212113 -1.4492
H  -7.708711 -0.806526 -0.606978
H  7.16511 -1.633464 -1.067887
H  5.745744 -2.723789 -1.248844
H  7.705015 -2.713144 1.170434
H  6.291156 -3.794808 0.994379
H  7.67463 -3.941905 -0.129347
