program: Gaussian 09
title: 000032018
version: EM64L-G09RevD.01
frameworkgroup: C1[X(C8H5Cl4NO)]
method: RPBEPBE
basis: SDD
operation: Freq
keyword: #p
keyword: freq=noraman
keyword: PBEPBE/SDD
title: #p freq=noraman PBEPBE/SDD
converged: YES YES NO NO
title: Mulliken charges:
elementType: Cl Cl Cl Cl O N C C C C C C C C H H H H H
charge: -0.026509 0.009284 0.010674 -0.057121 -0.241736 -0.439020 0.687350 -0.418672 -0.267137 -0.093918 -0.201254 -0.119238 0.263040 -0.672467 0.340297 0.336751 0.285325 0.302158 0.302191
chargesum: 0.00000
title: Mulliken charges with hydrogens summed into heavy atoms:
elementType: Cl Cl Cl Cl O N C C C C C C C C
charge: -0.026509 0.009284 0.010674 -0.057121 -0.241736 -0.102269 0.687350 -0.418672 0.073160 -0.093918 0.084072 -0.119238 0.263040 -0.068117
polarizability: 2.12602519e+02 5.98829527e+00 1.56156346e+02 5.58553771e-02 -6.12172647e-02 5.23956278e+01
1716.lowfreq: -5.1709 -1.8396 -0.0034 -0.0027 -0.0009 4.0510 26.7334 50.0191 76.8075
frequency: 26.7111 50.0175 76.8063 81.4054 98.0681 144.3044 163.1375 179.6346 197.7032 240.5684 262.1009 312.4158 355.8889 365.8799 400.7862 448.2330 478.1199 503.2313 556.6384 575.5074 619.4068 664.3082 695.2286 702.2865 752.5532 778.0598 855.2152 904.1457 908.3533 920.9977 947.6458 1031.0396 1117.4158 1156.1752 1211.9007 1240.0385 1254.2963 1262.4968 1360.8946 1372.1775 1419.8085 1446.3029 1510.1287 1571.2762 1596.5333 1606.3163 3069.2745 3150.0927 3183.0877 3185.5245 3411.4187
redmass: 13.6431 11.2727 3.3274 17.7853 10.2138 22.7292 6.5499 28.9731 20.4720 5.7448 14.2394 26.4780 13.4470 8.4723 12.4522 3.2626 8.2927 7.2662 3.4682 6.9697 7.5333 7.3786 6.4502 3.0922 8.3143 1.2336 1.4181 7.6977 1.7355 1.3979 6.4998 5.5676 1.8866 1.1099 3.3105 1.3438 3.0556 1.1892 5.1691 10.2826 1.0942 2.9114 3.2394 4.0538 8.0261 6.2761 1.0566 1.1090 1.0928 1.0936 1.0767
irintensity: 0.3451 0.0000 16.2328 0.0362 1.1391 3.6852 0.0480 0.1742 1.9275 0.0870 1.2072 0.9101 14.9714 0.0019 27.6496 18.4294 5.8272 7.5525 0.2462 22.1402 0.2459 10.7978 95.0844 2.0423 23.3687 63.5333 13.4350 12.5896 15.2632 39.3715 6.2004 70.5696 22.9939 0.4113 31.3370 12.0608 3.4152 18.8715 110.3733 4.3690 29.8607 72.0747 575.4810 131.4101 126.5086 104.0746 2.5664 0.3307 24.6540 1.8643 94.8529
temp: 298.150 k
press: 1.00000 atm
elementType: 17 17 17 17 8 7 6 6 6 6 6 6 6 6 1 1 1 1 1
symmnumber: 1
zpe: 301587.9 jmol-1
zpe.correction: 0.114869 hartree
zpe.thermalcorrener: 0.128735 hartree
zpe.thermalcorrenthalpy: 0.129679 hartree
zpe.thermalcorrgfe: 0.071432 hartree
zpe.sumelectzpe: -2277.067860 hartree
zpe.sumelectthermal: -2277.053994 hartree
zpe.sumelectthermalent: -2277.053050 hartree
zpe.sumelectthermalfe: -2277.111296 hartree
dipole: 2.0525 1.2517 0.0010
dipole: 2.4041
quadrupole: -109.5258 -111.8624 -108.7310
quadrupole: -6.8974 0.0303 0.0261
quadrupole: 0.5140 -1.8227 1.3087 -6.8974 0.0303 0.0261
hfenergy: -2277.1827285 hartree
pointgroup: C01 [X(C8H5Cl4N1O1)]
dipole: -0.6397302 -0.6831446 0.1367147 debye
dipolederiv: -0.2367165 -0.2191407 0.0439318 -0.2098467 -0.5886897 0.1393684 0.0410541 0.1383839 -0.0655766 -0.1759158 -0.2183777 0.0481944 -0.3000694 -0.5802083 0.1315734 0.0713485 0.1385849 -0.054179 -0.8342742 -0.0564595 -0.0539145 -0.0292471 -0.0547738 0.0081001 -0.0614202 0.0057662 -0.0240372 -0.3964252 -0.0979565 0.0051568 -0.3266225 -0.4923935 0.0670121 0.0674679 0.0866367 -0.1624598 -0.7482497 -0.2197176 0.0253326 0.5086164 -0.8892284 0.1950927 -0.1755923 0.1327453 -0.3941121 -1.8198735 0.2092549 -0.191758 0.4477453 -0.5529949 0.1175695 -0.258745 0.0973123 -0.3187895 1.1656712 -0.1239193 0.1245675 0.1471375 -0.1252615 0.0828903 0.0498444 0.0594058 0.1136283 0.0644503 0.3288282 -0.0765906 0.3789957 0.8425871 -0.2395319 -0.0905902 -0.2433873 -0.0629502 -0.3053852 -0.0364297 -0.0079569 -0.1656403 -0.2367858 0.0255662 0.0279613 0.0370846 -0.1029809 0.0695127 0.3772268 -0.0959043 0.4473602 0.9325544 -0.2377763 -0.1159431 -0.2437257 0.0099887 -0.2491153 -0.0128517 -0.0159496 -0.1611461 -0.1504986 0.0230373 0.0260183 0.0354453 -0.0276424 1.0932501 -0.0365462 0.1094011 0.0233457 -0.1596002 0.0273648 0.0923188 0.0222976 -0.0677464 1.5773067 0.0334185 0.1102115 -1.1425292 1.0085452 -0.3224075 0.4358588 -0.2214613 0.3005785 -0.0158654 0.0451795 -0.0257954 0.3881667 0.6550519 -0.1070316 -0.1194754 -0.1368461 0.1675381 0.2125447 0.0282823 -0.0056503 -0.0213255 0.1087172 0.0202148 0.0079156 0.0242255 0.1805275 0.4021191 0.0367226 0.0004425 0.038116 0.2462636 0.0140302 -0.0001489 0.013912 0.2816039 0.0792518 0.0176786 -0.0127044 0.0255718 0.0541808 0.034615 -0.0148596 0.0339531 0.158554 0.0680764 -0.0394038 -0.0242559 -0.0473376 0.0101967 0.0500171 -0.0610363 0.0316007 0.0060828 0.0496377 -0.0157889 0.0432417 -0.001291 -0.0276623 -0.0297045 0.0780232 -0.0119335 0.0619724 unknown
polarizability: 204.1823528|22.531038|156.3905061|6.7250146|-27.1787183|60.581634 unknown
InChI: InChI=1S/C8H5Cl4NO/c9-3-8(14)13-7-2-5(11)4(10)1-6(7)12/h1-2,13H,3H2
charge 0 multiplicity 1
19 atoms
Cl 0.008148 -3.032586 0.741485
Cl 2.628398 2.666927 -0.637836
Cl 4.525966 0.119821 0.240658
Cl -4.190281 -1.894353 0.045772
O  -2.257592 1.599324 -0.749571
N  -1.496183 -0.534672 -0.091667
C  -0.097947 -0.329767 -0.028013
C  0.746568 -1.410528 0.348557
C  0.514668 0.916514 -0.325975
C  1.911831 1.055748 -0.245663
C  2.139381 -1.275804 0.430004
C  2.730169 -0.03059 0.129976
C  -2.464865 0.389466 -0.432047
C  -3.92148 -0.082262 -0.427056
H  -0.115155 1.759388 -0.617031
H  -1.831126 -1.480628 0.141368
H  2.762825 -2.123869 0.722152
H  -4.34667 0.038988 -1.434071
H  -4.494754 0.513081 0.298459
