program: Gaussian 09
title: 000032143
version: EM64L-G09RevD.01
frameworkgroup: C1[X(C27H29ClN2O)]
method: RPBEPBE
basis: SDD
operation: Freq
keyword: #p
keyword: freq=noraman
keyword: PBEPBE/SDD
title: #p freq=noraman PBEPBE/SDD
converged: YES YES NO NO
title: Mulliken charges:
elementType: Cl O N N C C C C C C C C C C C C C C C C C C C C C C C C C C C H H H H H H H H H H H H H H H H H H H H H H H H H H H H H
charge: -0.060940 -0.266371 -0.093383 -0.126819 -0.347602 -0.354634 -0.406644 -0.389412 -0.494571 0.190305 -0.580711 -0.382257 0.463535 0.488004 0.538353 -0.548482 -0.467791 -0.398406 -0.382243 -0.383203 -0.444614 0.443950 -0.212574 -0.386480 -0.216828 -0.234835 -0.223527 -0.217862 -0.110940 -0.243958 -0.815155 0.191010 0.236762 0.214798 0.197511 0.223131 0.226627 0.261245 0.215513 0.221531 0.195231 0.218802 0.254850 0.230847 0.266012 0.235432 0.242438 0.252388 0.236649 0.222546 0.223993 0.231501 0.254177 0.254046 0.223236 0.223357 0.227215 0.225194 0.224608 0.235445
chargesum: 0.00000
title: Mulliken charges with hydrogens summed into heavy atoms:
elementType: Cl O N N C C C C C C C C C C C C C C C C C C C C C C C C C C C
charge: -0.060940 -0.266371 -0.093383 -0.126819 0.080170 0.057675 0.043114 0.087346 -0.077809 0.190305 -0.107059 -0.151409 0.463535 0.488004 0.538353 -0.282470 -0.232359 -0.155968 -0.129854 -0.146554 -0.222069 0.443950 0.011420 -0.154979 0.037349 0.019211 -0.000291 0.005495 -0.110940 -0.016744 -0.129908
polarizability: 3.26223238e+02 1.10259429e+01 3.33453807e+02 1.38098350e+01 -1.00343773e+01 2.74262714e+02
1716.lowfreq: -10.4714 -6.1544 -2.1751 -0.0009 -0.0002 0.0005 6.1051 12.7070 17.9656
frequency: 2.8696 11.7301 17.7678 20.2007 26.0800 29.1200 29.2707 41.0292 48.0279 56.1943 67.0354 87.5782 105.4230 142.3365 152.8229 161.5380 177.3056 206.6313 217.2426 224.2472 237.9723 270.2921 279.9787 300.3421 315.2272 327.6445 336.4863 364.4514 376.9074 401.9766 405.0425 407.0328 422.4382 435.7561 436.8966 463.8937 480.3899 484.6825 510.8163 526.8508 530.1591 572.7720 589.6935 607.2470 611.7793 617.1883 624.8262 650.3946 682.5107 702.5117 703.3219 717.6057 723.6296 731.3195 762.6921 766.2466 773.7603 793.7692 824.0066 830.3081 840.1412 849.1531 858.1537 898.6286 907.9563 918.0173 925.4746 933.7875 950.0028 954.9384 964.0694 968.4821 973.4730 981.8600 989.3884 991.4221 993.3304 996.0266 999.2579 999.9912 1009.2007 1024.1485 1032.9051 1048.4546 1049.4409 1053.6214 1074.8551 1082.1205 1088.7033 1102.3731 1112.7271 1128.7512 1140.7353 1154.0752 1161.6642 1172.0803 1179.3096 1186.7780 1188.3451 1190.1732 1192.5912 1197.7253 1207.0912 1230.9861 1248.7114 1256.2174 1260.1254 1277.0824 1286.1240 1292.2537 1297.1411 1303.3768 1329.0281 1330.3536 1335.8209 1340.6635 1355.9445 1361.3721 1374.4360 1376.4700 1385.4897 1391.1900 1395.1952 1396.9873 1416.9214 1431.4210 1442.4995 1448.8745 1456.1185 1458.2702 1464.4920 1471.0725 1472.9800 1475.0077 1476.7921 1479.5061 1483.2502 1485.1463 1582.8998 1585.6144 1594.5532 1599.2583 1599.2699 1612.7243 1618.2256 2847.2575 2853.6338 2870.3491 2974.8283 2975.1550 2985.7467 2987.5615 2987.9016 2997.7270 3033.6220 3048.4474 3054.6787 3080.7924 3083.9203 3093.7031 3101.5590 3112.7047 3113.1687 3120.2328 3122.5443 3127.8142 3129.6085 3132.7147 3144.0220 3145.4080 3150.1031 3162.2916 3167.5833 3171.0080
redmass: 6.6777 5.5810 3.6887 1.0595 4.0525 4.1568 3.8337 5.9049 4.8427 4.4102 4.8645 6.8781 6.0744 6.1820 4.8542 3.5946 3.9403 3.2486 4.2458 4.8338 5.6081 3.0021 2.7333 5.0236 3.1327 3.0612 2.6350 3.2150 3.9805 2.7990 2.3634 2.8712 3.1909 4.3385 3.2931 2.7916 2.9741 3.4550 4.1866 3.9269 3.2207 4.0992 4.0619 4.8813 4.5378 2.9998 6.4051 4.5619 4.9069 1.6852 2.4406 4.0490 3.3088 3.7935 2.4430 2.5076 2.7006 1.6250 1.9251 1.2532 1.5706 1.2587 2.7769 1.7539 1.4298 1.4506 1.6763 2.5055 1.4773 2.6839 1.8301 1.4904 1.3986 1.3500 5.9613 4.5668 1.4328 2.3750 1.8038 4.2518 1.7654 2.5956 2.8142 1.5721 1.8261 2.1604 2.7091 1.6722 1.8974 1.7794 1.4645 2.3724 2.9323 1.4289 1.7456 1.0603 1.0847 1.9590 1.1407 1.3812 1.8354 1.1395 1.9499 1.5019 1.7089 1.7200 1.9059 1.5262 1.5083 1.4211 1.2949 1.3420 1.4636 1.3223 1.2888 1.2799 1.3633 1.4216 4.7940 3.1632 6.7026 2.1291 2.7606 1.2379 2.5110 2.1530 2.1387 1.1033 1.0843 1.1396 1.1059 1.2754 1.3501 1.1380 1.6897 1.6845 1.5998 1.4782 7.5922 7.3062 6.1199 5.9868 6.1239 6.0864 6.2592 1.0711 1.0703 1.0695 1.0385 1.0684 1.0670 1.0860 1.0827 1.0637 1.0895 1.0890 1.0960 1.0979 1.0994 1.0962 1.0925 1.0870 1.0860 1.0860 1.0917 1.0910 1.0897 1.0908 1.0958 1.0881 1.0991 1.1014 1.0953 1.0965
irintensity: 0.0737 0.0621 0.0346 0.5208 0.0970 0.2072 0.0250 0.2290 0.1546 1.6921 0.9564 1.6805 1.1649 0.8149 1.7185 3.7373 3.4725 1.8064 0.0307 0.5645 0.2394 1.4883 0.1642 0.0136 6.1171 6.6707 3.8407 1.5608 3.3959 0.2652 1.4484 0.0609 6.9041 16.3443 6.3161 0.0597 9.3083 7.2215 1.0567 1.5675 24.5815 13.9683 15.5596 8.4308 0.6460 0.4834 0.3684 9.2448 2.2850 52.2015 19.9212 4.9736 25.0035 3.2008 39.6210 0.2374 12.4594 47.2492 27.3776 0.4470 0.3176 0.1489 27.7115 3.9454 2.0455 1.0948 6.5223 6.0977 1.5610 12.9477 5.3264 1.2925 0.1057 0.1132 1.8500 2.6885 1.5677 76.7208 13.5946 40.8999 2.6440 8.5459 2.8587 19.2064 1.0835 10.6204 42.6839 16.5180 12.6038 19.4536 10.3806 43.7590 13.8969 51.9698 11.2029 0.3071 0.9400 1.9491 0.4445 2.5687 4.5632 6.7754 15.2982 34.0252 21.7994 22.6244 38.0084 10.2526 5.9116 32.6613 5.5419 22.3471 5.2204 19.2820 6.2269 0.7509 2.5291 8.5435 1.0822 0.3096 0.5267 9.4023 6.0695 12.3101 137.4315 3.1334 11.8239 10.8023 2.1633 31.0577 3.7028 10.5377 15.9988 27.1267 69.5430 31.7913 5.4086 15.5726 230.0092 51.2361 0.9645 5.6441 3.2630 9.7049 20.5303 41.7278 47.2011 150.4243 26.1097 35.5720 42.6923 16.6421 18.5290 26.4752 50.4843 21.8627 21.8704 19.2010 19.3101 7.4634 19.6053 13.1191 0.2053 2.5739 26.7602 9.6647 7.7468 12.5976 41.2584 7.1905 31.6115 27.8223 7.3256 0.4187
temp: 298.150 k
press: 1.00000 atm
elementType: 17 8 7 7 6 6 6 6 6 6 6 6 6 6 6 6 6 6 6 6 6 6 6 6 6 6 6 6 6 6 6 1 1 1 1 1 1 1 1 1 1 1 1 1 1 1 1 1 1 1 1 1 1 1 1 1 1 1 1 1
symmnumber: 1
zpe: 1294076.2 jmol-1
zpe.correction: 0.492888 hartree
zpe.thermalcorrener: 0.521736 hartree
zpe.thermalcorrenthalpy: 0.522680 hartree
zpe.thermalcorrgfe: 0.424789 hartree
zpe.sumelectzpe: -1688.824783 hartree
zpe.sumelectthermal: -1688.795934 hartree
zpe.sumelectthermalent: -1688.794990 hartree
zpe.sumelectthermalfe: -1688.892881 hartree
dipole: 3.3952 0.9542 1.2764
dipole: 3.7506
quadrupole: -191.8756 -205.3842 -178.8293
quadrupole: 8.5398 -0.1445 -7.7559
quadrupole: 0.1541 -13.3545 13.2004 8.5398 -0.1445 -7.7559
hfenergy: -1689.3176702 hartree
pointgroup: C01 [X(C27H29Cl1N2O1)]
dipole: 1.3586012 -0.2602259 -0.513724 debye
polarizability: 328.1447407|-12.4771732|329.6553374|-12.9951164|-14.2334218|276.1396809 unknown
InChI: InChI=1S/C27H29ClN2O/c1-21-6-5-7-22(18-21)20-29-14-16-30(17-15-29)27(31)19-26(23-8-3-2-4-9-23)24-10-12-25(28)13-11-24/h2-13,18,26H,14-17,19-20H2,1H3
charge 0 multiplicity 1
60 atoms
Cl -5.224186 -5.449571 0.640992
O  -1.233203 2.939035 1.522756
N  3.248409 1.344993 0.556268
N  0.380496 1.607582 0.505359
C  2.381493 0.186968 0.877779
C  2.600557 2.619434 0.958156
C  1.021056 0.321935 0.161084
C  1.245489 2.779985 0.244879
C  4.620732 1.204719 1.101313
C  -0.846062 1.787543 1.147111
C  -1.731841 0.553194 1.363217
C  -2.390297 0.021645 0.048332
C  5.420996 0.088248 0.436057
C  -3.079808 -1.337095 0.243307
C  -3.348555 1.064207 -0.553238
C  5.35447 -0.105035 -0.966868
C  6.271759 -0.741565 1.204135
C  -3.33703 -2.142396 -0.897581
C  -3.499613 -1.819492 1.508425
C  -4.638262 1.274461 -0.003233
C  -2.9437 1.850351 -1.659272
C  6.12239 -1.102523 -1.614757
C  7.047029 -1.741755 0.572973
C  6.972257 -1.922373 -0.824736
C  -3.985555 -3.390579 -0.79071
C  -4.15361 -3.067004 1.639202
C  -5.499835 2.25263 -0.543407
C  -3.804471 2.82983 -2.204756
C  -4.38609 -3.834798 0.484845
C  -5.086477 3.034627 -1.647641
C  6.060477 -1.28151 -3.122816
H  2.206274 0.100718 1.981698
H  2.88312 -0.737315 0.540003
H  3.263027 3.458239 0.674074
H  2.435052 2.670677 2.064042
H  1.196251 0.283673 -0.933497
H  0.372617 -0.522817 0.437833
H  0.710674 3.673625 0.6046
H  1.416027 2.865478 -0.846674
H  5.133304 2.172877 0.92823
H  4.616727 1.042375 2.209311
H  -1.163647 -0.265174 1.845986
H  -2.514431 0.880614 2.067881
H  -1.580977 -0.130061 -0.69323
H  4.677738 0.535068 -1.545938
H  6.325728 -0.60969 2.292103
H  -3.033849 -1.784492 -1.888822
H  -3.319065 -1.231321 2.413902
H  -4.974696 0.663717 0.843142
H  -1.946194 1.700744 -2.092287
H  7.701551 -2.3847 1.172625
H  7.571616 -2.704194 -1.307799
H  -4.176377 -4.002749 -1.676906
H  -4.473673 -3.430299 2.620247
H  -6.493657 2.404407 -0.107079
H  -3.474525 3.431779 -3.059078
H  -5.756147 3.793295 -2.067925
H  5.156618 -0.81359 -3.549778
H  6.059018 -2.350072 -3.404965
H  6.937082 -0.816603 -3.614474
