program: Gaussian 09
title: 000032043
version: EM64L-G09RevD.01
frameworkgroup: C1[X(C19H22N2O)]
method: RPBEPBE
basis: SDD
operation: Freq
keyword: #p
keyword: freq=noraman
keyword: PBEPBE/SDD
title: #p freq=noraman PBEPBE/SDD
converged: NO YES NO NO
title: Mulliken charges:
elementType: O N N C C C C C C C C C C C C C C C C C C C H H H H H H H H H H H H H H H H H H H H H H
charge: -0.251919 -0.052620 -0.112505 0.309112 -0.538877 -0.538231 -0.396174 -0.400847 0.034097 0.186163 -0.094885 0.316564 -0.621399 -0.484075 0.199502 -0.622627 -0.380474 -0.437711 0.192765 -0.265472 -0.243211 -0.769377 0.260061 0.216462 0.214547 0.240282 0.182693 0.215623 0.215849 0.183369 0.231089 0.220828 0.243400 0.231290 0.224658 0.185226 0.223592 0.254051 0.233414 0.228204 0.225940 0.241516 0.244023 0.256086
chargesum: 0.00000
title: Mulliken charges with hydrogens summed into heavy atoms:
elementType: O N N C C C C C C C C C C C C C C C C C C C
charge: -0.251919 -0.052620 -0.112505 0.309112 -0.062354 -0.083402 0.002142 -0.001630 0.034097 0.186163 -0.094885 0.316564 -0.169482 -0.009385 0.199502 0.010849 -0.126422 -0.204297 0.192765 -0.037269 -0.017271 -0.027752
polarizability: 2.47273197e+02 -1.05142793e+01 2.46136127e+02 2.00304780e+01 3.20949194e+00 1.73704207e+02
1716.lowfreq: -10.6992 -4.2911 -0.0006 -0.0004 0.0004 1.9128 29.8111 44.9174 57.9033
frequency: 29.6596 44.9165 57.8912 80.5855 89.4351 104.9445 110.1399 148.3536 177.9042 180.8198 196.1555 219.8331 229.3758 237.4237 269.3621 299.6838 319.1669 329.8596 337.8037 358.7303 365.5883 384.5077 449.3265 454.7372 466.5114 472.3207 513.2267 527.5640 567.3870 597.5842 620.6051 636.7557 640.0042 690.8571 703.5058 727.0687 746.5772 761.5354 764.7564 769.6310 807.5937 840.8888 865.6048 881.4518 883.8292 907.0021 945.1795 953.3824 965.2794 988.1592 989.6522 1000.3879 1005.0715 1019.8696 1027.9852 1042.3824 1048.0386 1061.7929 1066.1403 1075.7711 1100.8408 1117.5145 1119.8383 1139.3001 1157.0905 1159.3286 1169.3543 1173.2449 1189.3569 1195.3477 1216.6655 1231.1250 1239.0310 1253.4215 1280.5790 1285.0961 1290.8723 1312.5773 1316.6956 1323.4654 1333.4571 1351.9616 1367.4062 1370.4969 1375.4771 1399.4805 1430.4222 1435.5452 1443.8963 1456.7833 1457.2458 1457.9004 1461.9962 1462.6291 1462.7661 1469.5519 1477.6803 1479.0134 1481.9990 1561.3780 1577.2617 1584.9359 1606.6792 1643.5977 2820.0053 2826.8297 2853.7597 2969.2123 2973.0439 2981.7071 2989.7669 2993.7851 3014.9988 3018.8586 3019.2229 3023.6423 3055.2838 3071.5278 3073.5904 3074.2620 3097.4385 3114.2071 3126.1937 3126.7892 3141.6765 3159.8798
redmass: 3.7185 3.8549 3.3154 2.4329 1.3550 3.0576 4.1957 3.7275 2.7050 2.7796 2.9478 4.1613 1.5171 1.8964 3.5814 3.2682 2.6169 3.0231 2.6020 3.8879 2.3885 3.0082 4.1856 2.3028 3.5040 2.9937 4.0362 3.9039 3.3967 4.1839 4.5274 5.2812 4.0450 4.7137 4.3465 5.2171 3.3388 2.7914 2.2225 2.0721 1.5954 3.3670 4.4053 1.6928 3.2235 2.4472 2.3346 1.4313 2.1391 1.3155 2.4165 2.1566 1.5723 2.6682 2.4438 2.3099 1.4691 2.6297 1.8692 2.4765 2.3864 1.8771 2.3647 2.4862 1.8966 1.2893 1.1092 1.0588 2.0737 1.6597 2.0786 2.1928 2.0204 1.8382 1.6051 1.4783 1.4375 1.5948 1.5440 1.4253 2.0237 1.5063 2.8096 2.0231 2.5381 1.2481 1.1737 2.3452 1.1032 1.0956 1.1453 1.0468 1.0512 1.0786 1.0930 1.1439 2.0124 1.2048 1.0552 7.5614 6.6732 7.9129 6.3476 9.2393 1.0715 1.0681 1.0586 1.0597 1.0656 1.0678 1.0639 1.0381 1.0721 1.0873 1.0973 1.0892 1.1014 1.0980 1.1008 1.0946 1.0923 1.0869 1.0981 1.0877 1.0937 1.1007
irintensity: 0.1993 0.0981 0.2098 0.3451 0.6660 2.4012 0.4092 2.0921 1.3878 3.0155 2.5312 0.4644 0.6372 1.0888 6.5093 0.5599 3.2884 2.8014 4.2359 0.8445 1.3344 0.9597 0.5350 0.7428 3.9070 0.0115 0.6280 4.3293 1.4480 0.4459 3.5438 1.3071 4.5212 2.6145 5.4103 2.9339 12.7480 11.1127 46.1044 24.9800 0.8557 6.7440 21.7758 2.2244 11.1128 1.5777 15.0201 2.3363 4.2211 0.2234 31.1630 4.9277 1.2457 6.3627 2.2026 4.1892 3.6823 1.6797 10.4538 23.9661 2.8014 15.2925 8.6714 41.5769 1.2935 2.9902 1.8941 0.5687 3.3783 8.5184 12.6858 10.4403 7.1408 2.5924 10.7805 3.6987 17.5536 0.3693 6.1796 13.4711 5.4623 4.3570 10.2996 9.3012 0.5631 11.0607 2.6709 4.1549 10.1857 16.0945 3.4268 13.4528 27.1504 1.4834 20.8897 13.6133 20.1980 13.5167 7.5031 54.5547 0.1361 26.5117 1.3680 18.3733 49.3247 61.5557 212.4429 37.5668 13.3138 24.9645 20.0189 24.3091 48.8496 53.3840 32.6612 72.7271 27.3168 12.0396 26.5383 27.1613 7.3868 8.9393 5.4167 5.5375 27.9618 31.4131
temp: 298.150 k
press: 1.00000 atm
elementType: 8 7 7 6 6 6 6 6 6 6 6 6 6 6 6 6 6 6 6 6 6 6 1 1 1 1 1 1 1 1 1 1 1 1 1 1 1 1 1 1 1 1 1 1
symmnumber: 1
zpe: 963015.1 jmol-1
zpe.correction: 0.366793 hartree
zpe.thermalcorrener: 0.386386 hartree
zpe.thermalcorrenthalpy: 0.387330 hartree
zpe.thermalcorrgfe: 0.318904 hartree
zpe.sumelectzpe: -920.318508 hartree
zpe.sumelectthermal: -920.298915 hartree
zpe.sumelectthermalent: -920.297971 hartree
zpe.sumelectthermalfe: -920.366398 hartree
dipole: 0.5863 -0.0975 1.7633
dipole: 1.8608
quadrupole: -125.8148 -118.7323 -126.8338
quadrupole: 0.1710 -0.3391 0.6420
quadrupole: -2.0212 5.0613 -3.0402 0.1710 -0.3391 0.6420
hfenergy: -920.6853013 hartree
pointgroup: C01 [X(C19H22N2O1)]
dipole: 0.2755409 0.0238893 0.6778487 debye
polarizability: 253.1688085|-8.7314193|242.6163332|14.4521838|5.6376482|171.3283901 unknown
InChI: InChI=1S/C19H22N2O/c1-13-20-19-17(22-13)8-7-14-5-3-4-6-16(14)18(19)15-9-11-21(2)12-10-15/h3-6H,7-12H2,1-2H3
charge 0 multiplicity 1
44 atoms
O  2.092691 2.956347 0.290037
N  -4.187939 -0.546113 0.416823
N  0.239554 2.445763 -0.945167
C  -1.40346 -0.183122 -0.435353
C  -2.394384 0.971092 -0.437171
C  -2.097617 -1.535813 -0.52692
C  -3.513828 0.757064 0.610513
C  -3.223296 -1.660494 0.531782
C  -0.039794 -0.033574 -0.306217
C  0.911374 -1.203405 -0.347345
C  0.625278 1.288637 -0.190404
C  1.860967 -1.436285 0.695283
C  1.939215 -0.51206 1.901923
C  2.583799 0.859796 1.55381
C  1.751703 1.604092 0.559285
C  -5.353924 -0.715645 1.304125
C  0.913388 -2.066587 -1.475652
C  2.757459 -2.528166 0.585836
C  1.113071 3.392968 -0.644754
C  1.813835 -3.148722 -1.575513
C  2.741105 -3.3860 -0.53618
C  1.205047 4.796633 -1.136997
H  -1.896549 1.937496 -0.269814
H  -2.872433 1.022549 -1.436517
H  -2.569545 -1.636802 -1.525679
H  -1.391152 -2.372178 -0.399196
H  -3.072015 0.838325 1.639752
H  -4.267845 1.560535 0.51034
H  -3.765134 -2.613058 0.379338
H  -2.758513 -1.698226 1.553427
H  0.927804 -0.329977 2.313997
H  2.539073 -0.987382 2.698879
H  3.606932 0.700014 1.157737
H  2.690644 1.468206 2.473821
H  -6.075293 0.103422 1.131216
H  -5.088481 -0.716751 2.392812
H  -5.860353 -1.671266 1.076707
H  0.210235 -1.8662 -2.291706
H  3.475965 -2.70723 1.395599
H  1.795325 -3.795662 -2.459703
H  3.444358 -4.223863 -0.600208
H  1.127789 5.520311 -0.30558
H  2.167412 4.979693 -1.647944
H  0.38503 4.979735 -1.847622
