program: Gaussian 09
title: 000032004
version: EM64L-G09RevD.01
frameworkgroup: C1[X(C12H10ClN3)]
method: RPBEPBE
basis: SDD
operation: Freq
keyword: #p
keyword: freq=noraman
keyword: PBEPBE/SDD
title: #p freq=noraman PBEPBE/SDD
converged: YES YES NO NO
title: Mulliken charges:
elementType: Cl N N N C C C C C C C C C C C C H H H H H H H H H H
charge: -0.063581 -0.124205 -0.656723 -0.000635 0.318772 0.261460 0.128049 -0.392710 -0.370856 -0.290357 -0.313040 -0.194285 -0.191112 -0.121154 -0.336409 -0.341686 0.268322 0.255535 0.277844 0.218554 0.254038 0.255259 0.245299 0.242416 0.349916 0.321288
chargesum: 0.00000
title: Mulliken charges with hydrogens summed into heavy atoms:
elementType: Cl N N N C C C C C C C C C C C C
charge: -0.063581 -0.124205 0.014481 -0.000635 0.318772 0.261460 0.128049 -0.124388 -0.115321 -0.012513 -0.094486 0.059753 0.064147 -0.121154 -0.091110 -0.099270
polarizability: 3.02622252e+02 6.16368170e+00 1.45839750e+02 9.03858635e-01 5.49175833e+00 7.55540304e+01
1716.lowfreq: -12.4597 -4.4372 -0.0014 -0.0004 0.0027 1.8599 31.2589 37.6163 44.7689
frequency: 31.2055 37.5711 44.7643 86.3553 115.6078 175.2423 182.5619 245.6021 281.9693 323.4452 365.0678 372.5101 402.0671 409.1526 429.9515 470.4808 484.9820 518.9887 564.6518 590.2554 623.6754 657.4875 663.9096 678.3090 706.4513 748.4386 769.8397 801.4172 821.8868 832.6755 835.3160 889.2332 943.2978 957.8660 958.3601 965.8502 990.4710 990.8368 1038.3875 1058.2972 1070.2590 1087.4593 1101.8189 1131.7759 1175.1744 1218.4412 1245.0138 1285.1482 1304.8774 1325.4199 1342.5700 1365.4816 1400.9559 1401.4682 1464.2386 1472.1050 1549.6223 1563.1426 1585.0055 1591.0546 1602.1641 1640.0863 3126.3221 3133.7396 3140.7196 3150.2009 3153.7677 3165.4550 3174.8375 3179.6683 3527.9718 3671.6810
redmass: 3.8083 8.9721 5.7443 5.5664 7.3107 7.3638 6.4256 7.8972 4.8170 5.1660 3.4847 3.1173 7.4110 3.0900 1.5007 4.0838 2.3883 2.4345 1.3528 4.7340 7.0152 6.1073 6.6096 5.2394 4.0079 3.1231 3.8514 5.2041 1.2422 1.6978 1.5514 1.2593 1.3065 2.4103 1.4814 1.9904 1.8087 2.5528 2.1942 2.1004 2.6664 1.7245 1.3407 2.3678 1.1252 1.2959 3.8573 1.2749 6.3415 1.5272 4.7907 3.7591 1.9405 3.8399 2.1805 2.3789 7.6666 7.4836 5.6220 4.2290 2.7318 1.9124 1.0873 1.0890 1.0901 1.0973 1.0883 1.0958 1.0975 1.0958 1.0455 1.1028
irintensity: 0.0515 0.6245 1.5636 4.6377 0.9342 1.0111 3.3021 1.9837 5.2027 0.8319 10.6437 3.7382 6.6467 0.2753 72.6604 1.8635 39.0720 95.6702 60.1275 2.0035 3.5879 36.0296 25.8698 23.9376 6.3130 5.6606 5.8390 2.7265 2.1389 50.1912 65.5406 4.7677 0.4822 3.6391 0.6250 1.6242 5.7472 34.1231 36.5961 15.7735 51.9540 4.5342 13.2291 2.3112 4.8475 0.3897 32.1957 0.5861 2.2038 5.3094 10.5773 81.4905 23.0941 8.6387 55.7238 76.0795 75.0561 0.8910 37.3364 134.4447 71.8154 354.6811 11.0115 6.1356 26.3481 20.7222 3.5477 5.3912 3.5957 4.5598 23.7844 35.6446
temp: 298.150 k
press: 1.00000 atm
elementType: 17 7 7 7 6 6 6 6 6 6 6 6 6 6 6 6 1 1 1 1 1 1 1 1 1 1
symmnumber: 1
zpe: 510877.7 jmol-1
zpe.correction: 0.194583 hartree
zpe.thermalcorrener: 0.208314 hartree
zpe.thermalcorrenthalpy: 0.209258 hartree
zpe.thermalcorrgfe: 0.152151 hartree
zpe.sumelectzpe: -1086.469980 hartree
zpe.sumelectthermal: -1086.456249 hartree
zpe.sumelectthermalent: -1086.455305 hartree
zpe.sumelectthermalfe: -1086.512412 hartree
dipole: -0.4915 -2.9544 1.8423
dipole: 3.5163
quadrupole: -128.6710 -84.8597 -101.3712
quadrupole: 7.5023 -2.5755 0.1123
quadrupole: -23.7037 20.1076 3.5961 7.5023 -2.5755 0.1123
hfenergy: -1086.664563 hartree
pointgroup: C01 [X(C12H10Cl1N3)]
dipole: -0.1633392 -1.2340605 0.6035508 debye
dipolederiv: -1.0425533 -0.0031961 0.0204844 0.0485793 -0.1115311 -0.0299319 0.0015844 -0.0275827 -0.0909567 -1.7176378 -0.2614092 0.0723244 0.0059354 -0.559299 0.1129983 -0.0087495 0.0670939 -0.3020682 -0.400843 0.2318169 -0.1343409 -0.5679949 -1.0590344 0.1777171 -0.0459103 0.0815391 -0.5906051 -0.5121532 0.0126512 -0.0040137 -0.1051707 -0.31645 0.0000588 -0.0362118 0.0039333 -0.2476327 0.3546472 0.0977931 -0.0146532 0.0029382 0.0796368 0.0200903 0.04058 0.0111133 -0.0005761 1.3866593 0.1442882 -0.0482793 -0.044959 0.0147617 0.0176731 0.0098366 0.0167854 0.0280232 1.0062908 -0.0412752 0.0458004 0.5176074 1.1620599 -0.4408838 -0.0219979 -0.338061 0.2820165 -0.2791487 -0.0759 0.0118019 0.0333626 -0.0905542 0.0937505 0.2114042 0.1121952 -0.0911036 -0.3010646 -0.0401732 0.0242013 -0.0672493 0.0069274 0.0859096 -0.1661444 0.0903033 -0.0896284 -0.3757366 0.205625 -0.0052955 0.1634508 -0.1342127 0.0037878 -0.023496 -0.00094 -0.0580577 -0.3299146 -0.1678171 -0.0152349 -0.0113089 -0.0206664 0.0167354 -0.0394221 0.0230238 -0.1234576 -0.2553724 0.0283534 0.0217082 -0.059322 0.0137084 0.06949 -0.0490958 0.0713361 -0.0416456 -0.1900185 0.0090154 0.0156098 0.0296791 0.0060655 0.0691453 0.0855262 0.0821716 -0.0553146 1.2913105 -0.040035 -0.0216457 -0.0264833 -0.0223772 0.0516514 0.0208666 0.0430621 -0.0624347 0.3223338 -0.2234169 0.0139961 -0.0602043 0.344187 -0.0085136 0.0479622 -0.0249994 -0.0752069 0.2823161 0.2215159 0.0280817 0.1669258 0.1852241 0.0087741 0.0273478 0.0210742 -0.0685455 0.0184925 -0.0647454 -0.0581699 -0.0513136 0.0432883 -0.0791802 -0.0623681 -0.0744375 0.0932634 0.0535518 0.0786515 0.0375222 0.061606 0.0349533 -0.0812235 0.0213149 -0.0770307 0.1058854 0.1259894 -0.0940895 -0.0115623 -0.0933298 0.0546916 -0.0075997 -0.0375427 -0.0005154 0.144042 0.1045026 0.0907838 -0.0077368 0.066742 -0.0920584 0.0058748 0.0166174 0.0084644 0.1449883 0.0346072 0.0473273 0.0412061 0.0694322 0.0455443 -0.0829717 0.0319072 -0.0833147 0.1017722 0.0289299 -0.0650579 -0.0404784 -0.0649341 0.0487959 -0.0744818 -0.0415018 -0.0773293 0.1114833 0.0595238 0.0521683 -0.0065169 0.0590475 -0.0974481 0.0056411 0.0000096 0.0057224 0.134182 -0.020312 -0.1045776 -0.0106399 -0.1059367 -0.0380524 -0.0080352 -0.0099468 -0.0117528 0.1353831 0.1416607 0.020147 0.0000751 0.0645687 0.248555 0.0251692 -0.0462909 0.0066304 0.2981574 0.2139388 -0.0584439 0.045756 -0.0316684 0.2532847 0.0483548 0.0737209 0.071515 0.3180365 unknown
polarizability: 302.3198804|9.3372673|144.2942494|-0.6603285|12.4773802|77.4019028 unknown
InChI: InChI=1S/C12H10ClN3/c13-10-1-3-11(4-2-10)16-12(14)9-5-7-15-8-6-9/h1-8H,14H2
charge 0 multiplicity 1
26 atoms
Cl 6.100707 0.082735 -0.074122
N  0.044836 0.460591 -0.032105
N  -0.465837 -1.777323 0.702266
N  -5.049242 0.437202 -0.120084
C  -2.270217 -0.209736 0.120511
C  1.450212 0.298993 -0.017573
C  -0.807155 -0.504109 0.2557
C  2.125177 -0.748559 -0.716811
C  2.236157 1.291006 0.637159
C  -2.707398 1.137764 0.05848
C  -3.25741 -1.226285 0.044119
C  3.535432 -0.810365 -0.743639
C  3.643669 1.224203 0.631887
C  4.276832 0.169405 -0.05679
C  -4.085862 1.409223 -0.057243
C  -4.616973 -0.856747 -0.07434
H  1.547282 -1.48599 -1.285816
H  1.723234 2.113257 1.145202
H  -1.963639 1.937818 0.096745
H  -2.996033 -2.290271 0.034615
H  4.046098 -1.605321 -1.295411
H  4.2382 1.985209 1.145842
H  -4.450908 2.441123 -0.100898
H  -5.397912 -1.622701 -0.141268
H  0.516476 -2.017074 0.832138
H  -1.166824 -2.395448 1.102937
