program: Gaussian 09
title: 000031996
version: EM64L-G09RevD.01
frameworkgroup: C1[X(C16H13N3)]
method: RPBEPBE
basis: SDD
operation: Freq
keyword: #pfreq=noraman
keyword: PBEPBE/SDD
title: #p freq=noraman PBEPBE/SDD
converged: YES YES NO NO
title: Mulliken charges:
elementType: N N N C C C C C C C C C C C C C C C C H H H H H H H H H H H H H
charge: -0.129140 -0.659381 -0.001128 0.407740 0.367496 -0.596520 0.238558 -0.408012 -0.389860 -0.432112 -0.411126 -0.244649 -0.246049 0.139408 0.315655 -0.293942 -0.301305 -0.338729 -0.347160 0.268476 0.236727 0.253322 0.237488 0.238057 0.226622 0.227436 0.280850 0.207142 0.351351 0.316892 0.244650 0.241244
chargesum: 0.00000
title: Mulliken charges with hydrogens summed into heavy atoms:
elementType: N N N C C C C C C C C C C C C C C C C
charge: -0.129140 0.008861 -0.001128 0.407740 0.367496 -0.328044 0.238558 -0.171285 -0.136538 -0.194624 -0.173070 -0.018027 -0.018613 0.139408 0.315655 -0.013092 -0.094163 -0.094079 -0.105916
polarizability: 3.73955988e+02 -5.56673002e+00 1.65746527e+02 5.29866993e+00 4.62865207e-01 1.15247062e+02
1716.lowfreq: -0.5976 -0.0009 -0.0006 -0.0005 5.4045 5.7883 23.9140 36.2895 46.3090
frequency: 23.9013 36.2882 46.2875 64.2469 127.2144 148.5563 182.4026 192.1473 272.9023 303.0734 317.2086 367.3399 394.0381 405.5021 416.4197 428.6187 474.7710 478.0749 504.9134 520.7971 538.2738 558.0200 604.6537 629.6768 659.3130 662.6773 678.7557 722.2253 747.4240 755.7490 758.5004 776.8646 785.6982 830.7038 832.7022 868.0316 887.4471 889.9757 904.6198 944.4592 956.5967 957.7985 964.1669 975.9534 988.6533 992.2255 1022.7755 1037.6281 1058.3761 1087.4852 1122.4032 1133.2633 1149.7649 1171.5118 1194.0168 1219.9598 1237.5839 1265.8460 1273.9145 1304.9238 1325.6073 1341.0380 1369.2234 1399.0452 1402.6544 1418.2514 1437.5785 1456.4349 1470.6263 1507.9774 1549.1152 1569.4296 1586.1970 1592.7035 1601.3624 1631.2519 1640.3583 3117.2381 3120.2013 3122.6147 3125.3303 3125.6780 3140.2574 3140.9833 3149.4290 3161.0540 3163.1882 3178.1254 3533.4918 3682.5933
redmass: 3.8704 5.8160 4.9959 4.8690 5.4956 5.9379 3.7275 5.8526 4.8027 5.0726 3.9309 2.3502 2.9734 1.5543 3.4780 4.3384 2.4099 3.6703 4.7035 3.3641 2.7160 1.7221 5.0604 5.2883 4.0421 5.2485 4.5683 5.0537 3.0499 1.8642 2.9287 2.9921 2.8757 1.3681 1.5761 1.5067 1.6946 2.5049 1.6755 4.1906 1.3632 2.2263 2.5212 1.3777 1.3430 1.4246 2.2935 1.9755 2.1115 1.7498 1.6727 2.3349 1.2335 1.0827 1.6196 1.2936 1.9917 2.2715 1.8526 5.8532 1.5527 2.0105 3.3594 2.6855 2.5148 4.1714 3.9572 2.2845 2.2140 3.6851 7.5901 6.8482 5.2708 2.9392 4.1505 3.1386 2.6565 1.0863 1.0905 1.0891 1.0871 1.0885 1.0900 1.0945 1.0973 1.1001 1.0962 1.0959 1.0463 1.1022
irintensity: 0.0971 0.6603 1.2691 5.0017 1.4600 0.8301 1.8237 2.6477 2.4084 1.5631 11.0689 4.8235 5.1426 52.4052 28.0269 12.8531 50.9525 30.6560 15.0561 29.3653 26.5410 18.7744 1.9424 11.9211 3.5722 1.5201 25.1933 28.9699 8.1750 24.2646 16.2935 18.0082 6.0833 31.2794 50.1399 35.0956 6.9228 13.3585 8.8705 28.3788 4.0982 3.5052 2.8970 3.1531 0.0439 1.3247 1.8041 49.7763 18.2390 4.7015 12.7937 5.4536 1.8395 1.5737 8.0370 0.6425 13.3778 29.1163 6.1073 4.7815 6.0014 1.2550 86.2178 5.8268 23.8820 2.3839 4.5686 8.8076 10.0012 39.0606 72.6307 4.0143 85.4807 221.1103 3.3520 137.0301 206.4071 2.3306 14.6979 1.3965 11.9152 7.3078 29.3195 33.5520 24.5407 46.7074 9.2506 4.3653 21.7261 45.1019
temp: 298.150 k
press: 1.00000 atm
elementType: 7 7 7 6 6 6 6 6 6 6 6 6 6 6 6 6 6 6 6 1 1 1 1 1 1 1 1 1 1 1 1 1
symmnumber: 1
zpe: 657433.9 jmol-1
zpe.correction: 0.250403 hartree
zpe.thermalcorrener: 0.265509 hartree
zpe.thermalcorrenthalpy: 0.266453 hartree
zpe.thermalcorrgfe: 0.206470 hartree
zpe.sumelectzpe: -780.466899 hartree
zpe.sumelectthermal: -780.451793 hartree
zpe.sumelectthermalent: -780.450849 hartree
zpe.sumelectthermalfe: -780.510832 hartree
dipole: 1.9298 -2.5995 -2.1579
dipole: 3.8907
quadrupole: -121.8493 -99.3873 -109.1297
quadrupole: 6.0068 5.2029 2.5405
quadrupole: -11.7272 10.7348 0.9924 6.0068 5.2029 2.5405
hfenergy: -780.7173022 hartree
pointgroup: C01 [X(C16H13N3)]
dipole: -0.7609877 0.1297201 1.3218279 debye
polarizability: 374.0022858|6.8453939|130.7236559|-1.332794|-23.2877478|150.2236346 unknown
InChI: InChI=1S/C16H13N3/c17-16(13-7-9-18-10-8-13)19-15-6-5-12-3-1-2-4-14(12)11-15/h1-11H,17H2
charge 0 multiplicity 1
32 atoms
N  0.8616 0.317114 -0.544625
N  1.26233 0.258565 1.823798
N  5.905617 -0.36394 -0.362137
C  -2.771597 -0.466004 0.219449
C  -3.414048 0.639467 -0.46446
C  -1.342051 -0.551247 0.228272
C  -0.549026 0.407349 -0.435175
C  -2.586921 1.601043 -1.137618
C  -1.199949 1.486314 -1.135376
C  -3.595741 -1.441842 0.875621
C  -4.84357 0.729835 -0.460291
C  -4.9882 -1.327513 0.863902
C  -5.619873 -0.232445 0.191832
C  1.664668 0.199655 0.494971
C  3.130033 0.023307 0.232298
C  3.556965 -0.367951 -1.062226
C  4.129011 0.227294 1.218868
C  4.932972 -0.548799 -1.309004
C  5.485752 0.02415 0.877417
H  -0.865308 -1.407021 0.72259
H  -3.066154 2.432483 -1.668434
H  -0.567512 2.204432 -1.666575
H  -3.114951 -2.284681 1.387119
H  -5.322679 1.568347 -0.980291
H  -5.60529 -2.079461 1.368291
H  -6.712609 -0.15552 0.189677
H  2.806497 -0.51494 -1.8435
H  3.889675 0.570317 2.231695
H  0.278528 0.412347 2.041763
H  1.911986 0.104533 2.588962
H  5.287998 -0.855237 -2.298994
H  6.275746 0.180549 1.620779
