program: Gaussian 09
title: 000031999
version: EM64L-G09RevD.01
frameworkgroup: C1[X(C18H16N2O)]
method: RPBEPBE
basis: SDD
operation: Freq
keyword: #p
keyword: freq=noraman
keyword: PBEPBE/SDD
title: #p freq=noraman PBEPBE/SDD
converged: YES YES NO NO
title: Mulliken charges:
elementType: O N N C C C C C C C C C C C C C C C C C C H H H H H H H H H H H H H H H H
charge: -0.270036 -0.114501 -0.659668 0.174042 0.205712 0.388045 -0.387281 -0.406203 -0.443945 0.070152 -0.430649 -0.244966 -0.251729 -0.247585 0.226402 -0.389945 -0.373638 0.313146 -0.336747 -0.346981 -0.538380 0.268838 0.277573 0.239897 0.238258 0.231038 0.228441 0.229972 0.249351 0.260815 0.342280 0.332585 0.238307 0.246850 0.242494 0.220350 0.217706
chargesum: 0.00000
title: Mulliken charges with hydrogens summed into heavy atoms:
elementType: O N N C C C C C C C C C C C C C C C C C C
charge: -0.270036 -0.114501 0.015196 0.174042 0.205712 0.388045 -0.118444 -0.128630 -0.204048 0.070152 -0.192391 -0.013928 -0.023288 -0.017612 0.226402 -0.140594 -0.112823 0.313146 -0.098441 -0.100131 0.142171
polarizability: 3.74174768e+02 4.16779846e+00 1.99290879e+02 -1.97373410e+00 8.18966977e-01 1.34276665e+02
1716.lowfreq: -11.1365 -3.0195 -0.0006 -0.0002 0.0004 5.5763 22.7050 33.9611 40.7073
frequency: 22.4940 33.8888 40.6260 73.4167 92.6671 109.3608 150.4154 166.7306 179.6661 202.7098 220.9372 249.2607 252.0036 337.8258 365.4861 371.9737 412.1524 415.3710 427.5067 446.1632 463.8169 473.7719 494.0769 500.7286 515.4150 533.4812 546.8399 579.7149 620.3395 634.0405 646.5299 692.5222 701.1475 712.3383 739.9241 756.2978 786.4993 788.1585 800.6508 811.4751 825.4652 832.5636 849.4190 888.8097 932.1421 933.3098 951.8658 972.2617 987.9883 989.9715 993.4783 998.2729 1000.0838 1028.7984 1047.8221 1075.3171 1103.5249 1112.8331 1144.4322 1155.5903 1163.0763 1167.6687 1177.2404 1205.9092 1216.6168 1233.3120 1244.0511 1266.6403 1291.3802 1341.1938 1353.4637 1375.3008 1405.6495 1412.3236 1420.0882 1436.1059 1439.3547 1456.1994 1465.6581 1472.9703 1489.5818 1516.2612 1565.0277 1582.5986 1590.1327 1597.4200 1619.5682 1624.8026 1631.1420 2954.0739 3039.2517 3121.5189 3122.0009 3125.3188 3128.4369 3133.7085 3144.6201 3148.7226 3153.2381 3160.7338 3166.1031 3166.7939 3168.4655 3522.6658 3671.5464
redmass: 4.0620 4.6765 5.0419 4.7686 4.0523 4.3611 4.4654 5.3799 4.1144 3.4836 2.1246 2.3741 2.4125 3.7400 5.2354 4.2543 2.9777 4.2142 3.1354 2.9253 1.6693 3.2023 2.1252 3.7661 2.0588 5.6153 2.5084 2.9835 5.4484 4.8447 4.0578 5.5714 4.3546 4.0343 3.6728 1.4986 2.1953 4.2182 3.4198 1.3869 1.6655 1.8336 4.3881 1.6187 1.3673 1.4023 1.3283 1.3752 6.4783 1.7629 2.9391 2.3919 1.4882 2.4526 1.8852 2.0561 1.3298 1.2604 1.6091 1.3309 1.2941 1.2016 1.1126 1.7822 2.5420 2.2988 3.3543 1.6492 1.3256 2.7647 3.5331 3.9161 2.6961 6.3905 3.8646 1.2005 2.3956 2.6169 1.0505 1.1189 2.2234 3.9412 7.1173 4.3504 5.8571 2.9843 5.5081 2.1315 4.5796 1.0332 1.1036 1.0988 1.0864 1.0872 1.0884 1.0891 1.0873 1.0928 1.0944 1.0953 1.0994 1.0964 1.0973 1.0449 1.1039
irintensity: 0.8090 0.6134 0.4046 2.9995 2.4630 3.8028 2.7822 1.1405 2.5809 2.2570 2.4098 0.9604 3.1379 4.9357 1.7269 8.8745 2.9802 19.2661 29.8977 41.0100 89.6448 5.8882 32.0195 24.6817 39.0345 8.5350 7.5069 5.0969 4.9040 1.0221 2.9976 25.4166 1.2529 11.4418 19.6482 2.7335 57.7081 12.2537 13.4252 7.2999 66.8851 44.1901 3.3055 7.9612 0.1541 1.3396 0.7726 1.6511 41.0173 1.8201 3.7914 33.5746 2.8798 19.1135 26.2442 24.4577 15.8000 0.2327 0.8339 0.5163 3.0097 40.7989 0.4492 44.3538 222.9332 21.7156 9.1463 16.6413 1.4761 55.9185 40.4749 5.9305 7.6083 2.7066 3.5919 17.0413 11.3528 6.3632 14.2438 117.7293 166.6745 7.6470 34.5116 134.9382 34.1460 76.9309 22.8842 246.5732 81.8491 89.3100 52.4215 32.5760 0.7885 3.1253 10.4368 12.6698 13.0608 21.3045 27.6155 13.6469 32.5564 9.0149 8.3897 23.0742 40.2541
temp: 298.150 k
press: 1.00000 atm
elementType: 8 7 7 6 6 6 6 6 6 6 6 6 6 6 6 6 6 6 6 6 6 1 1 1 1 1 1 1 1 1 1 1 1 1 1 1 1
symmnumber: 1
zpe: 770875.4 jmol-1
zpe.correction: 0.293611 hartree
zpe.thermalcorrener: 0.311480 hartree
zpe.thermalcorrenthalpy: 0.312424 hartree
zpe.thermalcorrgfe: 0.246606 hartree
zpe.sumelectzpe: -878.777537 hartree
zpe.sumelectthermal: -878.759668 hartree
zpe.sumelectthermalent: -878.758723 hartree
zpe.sumelectthermalfe: -878.824542 hartree
dipole: -0.8356 -2.0304 0.7062
dipole: 2.3064
quadrupole: -98.7464 -114.7482 -120.9862
quadrupole: -5.3070 -9.5872 0.4771
quadrupole: 12.7472 -3.2546 -9.4926 -5.3070 -9.5872 0.4771
hfenergy: -879.0711478 hartree
pointgroup: C01 [X(C18H16N2O1)]
dipole: -0.3191663 0.590865 -0.6102182 debye
polarizability: 374.0502193|-4.6756643|186.7874245|4.6074597|-25.7627351|146.9046685 unknown
InChI: InChI=1S/C18H16N2O/c1-21-15-11-9-14(10-12-15)20-18(19)17-8-4-6-13-5-2-3-7-16(13)17/h2-12H,19H2,1H3
charge 0 multiplicity 1
37 atoms
O  6.248367 0.03122 -0.558497
N  0.697871 -0.349877 0.593014
N  -0.09174 0.278522 -1.592772
C  -2.825832 0.315699 -0.204527
C  -1.677865 -0.503504 0.127077
C  -4.147353 -0.165465 0.164018
C  -1.856705 -1.691245 0.851296
C  -2.731818 1.610656 -0.825633
C  -4.282975 -1.406237 0.868472
C  -0.27122 -0.170639 -0.283642
C  -5.301759 0.623681 -0.157509
C  -3.154824 -2.145765 1.225419
C  -3.875132 2.36073 -1.11258
C  -5.175495 1.859199 -0.792899
C  2.072863 -0.206469 0.251633
C  2.899576 0.604029 1.072968
C  2.692741 -0.931548 -0.814428
C  4.879242 0.000976 -0.230854
C  4.286413 0.721488 0.835807
C  4.076415 -0.834497 -1.046566
C  7.117978 0.856985 0.279062
H  -0.966482 -2.266885 1.122348
H  -1.744512 2.028928 -1.042389
H  -5.287622 -1.756255 1.134249
H  -6.291312 0.240586 0.11961
H  -3.258594 -3.083474 1.781374
H  -3.775714 3.349097 -1.575103
H  -6.063412 2.454995 -1.030388
H  2.434743 1.136195 1.909175
H  2.089435 -1.607611 -1.431689
H  0.844684 0.510224 -1.922498
H  -0.866807 0.298537 -2.250737
H  4.886989 1.361226 1.489723
H  4.558255 -1.402518 -1.848792
H  8.126226 0.736289 -0.144116
H  7.112287 0.511869 1.331853
H  6.823488 1.924557 0.240421
