program: Gaussian 09
title: /home/michael/molsimp_comfiles/Fe_31a_1_OH/Fe_31a_1_OH.com auto generated
version: ES64L-G09RevE.01
frameworkgroup: C1[X(C31H24FeN7O)]
method: UTPSSh
basis: Gen
operation: Freq
keyword: #P
keyword: Geom=AllCheck
keyword: Guess=TCheck
keyword: SCRF=Check
keyword: GenChk
keyword: UTPSSh/ChkBas
keyword: Freq
title: /home/michael/molsimp_comfiles/Fe_31a_1_OH/Fe_31a_1_OH.com auto genera
converged: YES YES NO YES
polarizability: 8.46603522e+02 2.72679981e+01 6.33423756e+02 -8.15138002e+01 -5.41553335e+01 5.74841926e+02
1716.lowfreq: -7.8413 -0.0007 0.0001 0.0007 9.7312 10.8689 24.0416 29.0623 33.4856
frequency: 23.5260 28.9801 33.1738 43.3555 48.9391 55.4206 56.9614 80.0243 99.4241 108.9807 120.6570 127.3576 130.0625 144.0896 147.9262 168.7460 185.4219 189.6622 194.5071 207.6175 218.9331 236.9899 256.0326 259.9343 272.7369 288.5635 305.2298 319.4149 349.2704 356.8574 379.0118 392.3763 394.5732 402.5873 408.6879 424.0075 431.4932 445.6502 459.7957 462.8230 472.5501 476.3828 478.1657 494.5267 503.4901 520.8221 532.3663 533.3952 539.5406 543.2795 551.2199 572.9203 632.0046 637.6950 639.1482 645.5474 650.8268 655.4331 667.8836 677.6699 678.9983 732.7982 741.4026 756.9266 763.9633 765.2463 769.6887 781.6618 783.5889 784.1615 794.6914 795.6865 796.4356 837.9486 844.0489 844.7903 846.6928 865.1158 876.1445 895.1189 902.1547 906.4653 916.9305 935.6214 948.7087 973.7757 974.8053 984.9318 990.2841 991.3254 993.6434 1003.9636 1020.2635 1023.5508 1024.7884 1027.0912 1029.4956 1030.3731 1030.6810 1033.8180 1034.7451 1037.5035 1053.2695 1058.8555 1082.0912 1091.0783 1094.1069 1097.3700 1120.2937 1130.0041 1144.1365 1155.7847 1156.3704 1165.0480 1171.7177 1172.0189 1182.6219 1185.8362 1190.8195 1193.0436 1222.8386 1245.2560 1248.4876 1285.4430 1286.3230 1310.3843 1315.5231 1316.2155 1317.1166 1326.7921 1329.0780 1336.1392 1338.2505 1341.1556 1375.3333 1380.1559 1438.9946 1440.0544 1441.0240 1453.4771 1455.4176 1478.0261 1485.6145 1486.7816 1488.6519 1499.0841 1516.3707 1540.6666 1542.0575 1543.9407 1583.8249 1584.5675 1610.8673 1617.1425 1621.1617 1623.1037 1623.9560 1646.5978 1649.5891 1655.2184 1660.5434 1661.6009 3211.7238 3212.3070 3218.4944 3218.9799 3226.2427 3226.7572 3227.2969 3231.0219 3231.6691 3232.3298 3232.6668 3234.7340 3234.7641 3241.0631 3245.5913 3247.8679 3249.1903 3250.1452 3253.0087 3258.5082 3258.9192 3264.8451 3275.2832 3741.8444
redmass: 6.0106 5.4351 5.6671 5.4946 4.7551 5.4421 4.3871 4.5352 5.3119 4.7584 5.9086 6.5393 5.8409 5.7650 6.2605 6.5275 5.6273 6.4394 4.2283 5.4306 4.9854 5.4631 5.1366 5.7751 4.7745 7.3104 5.0468 6.1588 7.5098 8.2722 1.6054 4.0662 2.8122 3.8858 4.5259 7.2998 3.4509 3.1430 4.3404 5.6450 4.2271 3.0746 3.0650 3.7453 3.8518 3.1659 7.0322 7.0658 8.2492 7.8380 5.4573 12.6018 3.7120 7.3584 7.3032 7.1315 7.2393 6.9693 4.6721 5.0604 6.8064 6.6139 4.3614 1.9990 2.1389 1.3506 1.3563 1.2585 5.1929 5.1410 3.6065 2.1030 2.8773 2.3712 5.9653 5.9931 6.0808 1.3066 1.3124 1.5115 1.4586 1.3915 1.3239 1.4193 1.1265 5.0990 5.2845 1.4021 1.3236 1.4035 1.3273 1.3357 1.2820 1.3365 1.3225 1.3158 1.4307 3.2949 1.5993 2.2834 2.2928 7.3178 6.6601 7.4958 2.4853 3.2692 3.2146 1.9716 1.8736 1.6596 1.6689 1.4718 1.4995 1.5825 1.1977 1.1879 1.0999 1.1285 1.4210 1.4476 1.3813 3.0546 3.0858 1.7778 1.7600 2.4744 2.7050 2.1025 2.7782 5.4667 2.3214 3.0786 2.9606 2.0374 3.2587 3.9470 2.2926 5.7767 6.5776 2.0468 2.0226 2.2168 2.2705 2.2609 2.1626 2.5340 2.9304 2.9862 2.9723 3.1622 6.6356 6.7317 5.6831 5.4285 5.8370 6.5636 5.9301 5.2198 5.6866 6.1215 5.6677 5.6957 1.0875 1.0874 1.0893 1.0896 1.0956 1.0898 1.0956 1.0922 1.0893 1.0902 1.0929 1.0987 1.0987 1.0916 1.0918 1.0945 1.0953 1.0969 1.0981 1.0947 1.0957 1.0949 1.0939 1.0663
irintensity: 0.0571 0.0969 0.6552 2.5457 2.9469 7.4150 0.4964 0.1770 1.2376 3.7214 0.9627 0.0210 2.9086 1.1738 2.5246 1.1525 1.8111 1.0960 14.1705 4.7127 5.3281 11.0705 1.0204 0.2925 10.3370 0.5804 7.1139 7.4640 6.6355 36.6252 83.5364 36.8567 59.8285 0.9258 9.9648 9.9290 0.7306 28.4965 2.1665 0.1936 2.2235 7.6255 8.0088 1.9881 0.3134 7.7281 0.7940 0.7587 7.5272 7.3845 2.4502 330.8942 0.1942 13.0537 3.2469 10.8572 19.1095 13.9569 1.2481 1.6656 12.9463 1.8816 42.5460 2.0319 2.0906 50.5781 57.6474 192.9385 35.6016 24.0978 8.0145 4.5524 12.1496 8.7565 1.7937 1.9422 3.6259 73.3841 56.0313 19.5253 24.9558 18.4149 0.7876 0.3161 187.8804 2.5478 2.4897 1.8782 3.6087 1.9392 3.8489 0.0587 1.4571 0.0925 0.0144 0.0521 2.5966 12.0537 5.4794 6.0473 6.1755 21.4097 0.5506 16.3165 6.9678 1.9523 12.6997 1.3500 23.2726 11.3827 3.8541 9.9974 9.1765 3.5816 7.9732 13.7630 3.1109 16.9749 3.8896 3.8821 12.1919 15.9151 22.2060 1.8282 1.3331 2.5672 37.6826 8.6875 19.8942 34.4863 32.8786 9.9334 10.1987 48.4314 14.8989 55.5752 32.7896 93.3335 60.6617 10.0802 22.0478 12.5371 26.1742 22.6467 150.4373 4.0777 140.5336 22.0108 15.0406 21.9560 21.9098 16.1931 12.3515 25.6441 56.7856 35.9129 57.0014 44.4212 60.9068 15.9060 10.8529 5.5253 0.0465 0.0792 2.3719 3.2170 14.8100 4.3355 14.1437 0.5544 4.6662 5.1564 0.6663 37.0635 3.8012 1.2850 0.4302 0.1210 0.3987 0.7124 8.5333 0.3095 1.0215 8.4560 2.7370 75.5908
temp: 298.150 k
press: 1.00000 atm
elementType: 26 6 6 6 6 6 6 6 6 6 6 6 6 6 6 7 7 7 6 1 1 1 1 1 1 1 1 1 1 1 7 6 6 6 6 6 6 6 6 7 1 1 1 1 1 1 7 6 6 6 6 6 6 6 6 7 1 1 1 1 1 1 8 1
symmnumber: 1
zpe: 1306604.7 jmol-1
zpe.correction: 0.497659 hartree
zpe.thermalcorrener: 0.529009 hartree
zpe.thermalcorrenthalpy: 0.529953 hartree
zpe.thermalcorrgfe: 0.435089 hartree
zpe.sumelectzpe: -1777.095783 hartree
zpe.sumelectthermal: -1777.064434 hartree
zpe.sumelectthermalent: -1777.063490 hartree
zpe.sumelectthermalfe: -1777.158354 hartree
dipole: -5.8552 -3.5775 -3.8811
dipole: 7.8832
quadrupole: -95.9771 -142.7660 -150.8187
quadrupole: -20.5451 -22.6002 -15.4273
quadrupole: 33.8768 -12.9120 -20.9648 -20.5451 -22.6002 -15.4273
hfenergy: -1777.5934427 hartree
pointgroup: C01 [X(C31H24Fe1N7O1)]
dipole: 0.8081171 -0.1850763 2.9886454 debye
polarizability: 764.1138866|-77.1765712|693.1121792|98.1741343|-90.5745327|597.6431379 unknown
InChI: InChI=1S/C15H11N3.2C8H6N2.Fe.H2O/c1-3-10-16-12(6-1)14-8-5-9-15(18-14)13-7-2-4-11-17-13;2*1-2-4-8-7(3-1)5-6-9-10-8;;/h1-11H;2*1-6H;;1H2/q-3;2*-1;+6;/p-1
charge 2 multiplicity 2
64 atoms
Fe -0.08437202 -0.16740944 0.13995239
C  -0.28805819 -4.45016832 0.06521194
C  1.0474771 -4.79158238 0.27242158
C  1.99184694 -3.77591669 0.41885399
C  1.57120279 -2.44775968 0.37163237
C  2.46304552 -1.28630841 0.47041195
C  3.84822807 -1.28667961 0.6559199
C  4.50777658 -0.05786545 0.70967806
C  3.79779918 1.13918233 0.58337454
C  2.41407935 1.07818616 0.39964371
C  1.48241846 2.20900592 0.25995963
C  1.87628416 3.54652155 0.23495597
C  0.90558062 4.53837013 0.08828007
C  -0.43167874 4.16551264 -0.03003411
C  -0.75969093 2.81045985 0.00405282
N  0.16831616 1.85123312 0.14791459
N  1.79999038 -0.12067633 0.34441178
N  0.25580777 -2.12042255 0.1988128
C  -0.64479513 -3.10344149 0.02902849
H  -1.05293795 -5.20506425 -0.0720887
H  1.35480468 -5.83082618 0.30813974
H  3.04046194 -4.00688919 0.56161825
H  4.3949593 -2.21610811 0.75732418
H  5.58205144 -0.03049571 0.85363622
H  4.31005446 2.09189209 0.63129349
H  2.92370773 3.80815258 0.32365314
H  1.19456973 5.58342369 0.06525958
H  -1.21923729 4.9003478 -0.14713914
H  -1.7859638 2.48004532 -0.09170536
H  -1.67011099 -2.80673926 -0.14767806
N  -2.09821097 -0.1791818 -0.01527141
C  -2.89137211 -0.86503866 0.86130195
C  -4.26271025 -0.90414888 0.72993659
C  -4.855387 -0.21343641 -0.34229225
C  -6.24931379 -0.1694671 -0.60474561
C  -6.71353826 0.54218806 -1.68970325
C  -5.81741102 1.23497585 -2.55163954
C  -4.46025096 1.21238275 -2.32509081
C  -3.95487469 0.48374056 -1.21307194
N  -2.60765127 0.48097788 -1.02452576
H  -2.37947715 -1.38436719 1.66085063
H  -4.86205907 -1.46080001 1.44203197
H  -6.92840838 -0.69913025 0.0554601
H  -7.77823801 0.57912651 -1.89637134
H  -6.216206 1.78545304 -3.3972746
H  -3.76175842 1.73191081 -2.97239934
N  -0.25110091 -0.07952886 2.18622193
C  -1.06570214 0.82077397 2.80777269
C  -1.14612792 0.90177225 4.18146355
C  -0.36299945 0.0243796 4.95325181
C  -0.34615145 -0.00863882 6.37187641
C  0.46386016 -0.9158939 7.01991645
C  1.28589554 -1.82103764 6.29056685
C  1.29410374 -1.81518057 4.91495182
C  0.46656001 -0.88889022 4.22105053
N  0.50082708 -0.91172053 2.86253151
H  -1.64940201 1.46192451 2.16151203
H  -1.80326085 1.62770793 4.64782816
H  -0.97392028 0.68301127 6.92404283
H  0.48068963 -0.94617953 8.10454039
H  1.91130421 -2.5219465 6.83337855
H  1.91236813 -2.49750549 4.34165561
O  0.03834707 -0.19129525 -1.67579552
H  0.82037744 -0.70383951 -1.94656381
