program: Gaussian 09
title: /home/michael/molsimp_comfiles/Ru_oct_desorbed_3_OH/Ru_oct_desorbed_3_OH.com auto generated
version: ES64L-G09RevE.01
frameworkgroup: C1[X(C25H18N5O5Ru)]
method: UTPSSh
basis: Gen
operation: Freq
keyword: #P
keyword: Geom=AllCheck
keyword: Guess=TCheck
keyword: SCRF=Check
keyword: GenChk
keyword: UTPSSh/ChkBas
keyword: Freq
title: /home/michael/molsimp_comfiles/Ru_oct_desorbed_3_OH/Ru_oct_desorbed_3_
converged: YES YES YES YES
polarizability: 6.42365373e+02 5.19503127e+01 6.46870340e+02 -2.02821397e+01 -1.95365908e+01 5.48782098e+02
1716.lowfreq: -17.7341 -9.2307 0.0002 0.0007 0.0009 8.0236 21.8035 30.1446 33.6410
frequency: 21.7675 30.1039 33.4522 35.4476 36.7720 52.2973 54.4027 57.3256 59.3977 96.6775 111.0799 122.7483 127.8779 138.4270 157.5244 162.6397 173.0947 176.1193 185.4767 187.7943 190.6299 212.9585 239.6175 255.9634 270.8604 283.3511 297.2028 308.9746 315.7723 343.1969 354.9155 365.1723 371.5278 394.1359 396.6599 406.3862 418.4138 450.5676 464.9646 476.2426 476.8703 504.6715 507.9732 527.9099 531.0413 546.7127 569.6242 579.0580 638.6418 642.5610 647.6159 651.5056 656.3027 674.5645 678.8116 692.7248 700.5701 742.0133 751.5365 756.3440 768.6521 771.0923 772.0244 776.2376 784.5755 792.0053 823.0619 830.4722 844.3383 846.1047 871.5862 883.8720 896.7348 917.7318 928.9406 934.8201 945.8324 961.3025 972.7264 988.6698 995.3095 1009.5540 1016.9344 1019.3957 1021.9789 1022.1855 1025.5785 1034.3877 1035.1479 1048.3881 1052.0301 1088.5392 1092.7139 1102.1779 1108.1535 1128.2940 1133.0335 1156.2466 1170.4885 1170.8435 1181.4394 1187.2051 1188.0807 1212.2097 1223.9916 1231.8019 1242.6768 1284.9294 1304.6691 1311.6421 1313.1440 1322.2051 1336.8415 1355.8998 1367.4731 1382.6911 1392.1397 1411.9996 1437.9416 1449.5949 1453.7493 1482.0764 1486.1872 1494.6427 1519.2984 1519.9461 1541.6156 1556.5778 1582.8344 1599.2266 1608.6973 1613.6917 1619.4444 1625.9076 1642.5695 1647.5701 1654.6840 1661.9542 3205.6560 3208.8891 3215.8018 3218.6268 3224.0757 3226.3396 3230.7833 3231.3159 3231.5246 3231.9115 3236.8139 3237.4481 3242.1974 3246.3007 3250.0005 3252.5523 3255.4081 3740.0656
redmass: 6.4300 5.8033 6.1476 6.6786 5.8757 4.9193 7.9727 7.5571 6.9352 7.3645 8.4124 6.0117 6.4606 7.4947 7.3057 5.7900 8.0786 7.1757 4.7254 6.0704 6.1619 7.0161 6.6731 5.9919 7.5300 7.7519 7.2826 8.2695 7.8342 9.9352 8.2330 1.1871 6.7935 3.6073 2.7061 4.2971 9.3288 4.1736 4.1489 3.7244 3.3807 8.8828 3.8572 5.0586 7.0518 8.1150 7.9676 9.4747 7.2581 6.8952 7.6351 6.3426 6.3873 4.6810 8.6210 8.5572 1.7126 5.7861 2.6163 4.8409 1.3703 1.9741 1.8887 8.6188 5.4913 3.8310 1.9960 10.0087 2.5366 5.8965 1.3264 1.2515 1.4862 6.5294 1.1149 1.3837 1.3996 1.3191 5.1465 1.3248 1.4165 1.3153 6.0173 1.3875 1.3116 1.3361 1.3083 2.7321 4.5457 6.7017 7.1083 2.0201 2.5946 1.7355 1.6950 3.6171 1.7360 1.5023 1.0765 1.2142 1.3594 2.1024 1.4247 1.6890 1.9287 1.2156 3.0172 1.7677 7.2170 2.8439 5.0307 8.1418 3.0251 2.9279 6.0038 1.2362 5.0837 3.6627 6.9526 2.7950 1.9813 2.2812 2.2503 2.8470 2.8942 2.0346 2.9657 12.4711 6.6122 6.5881 8.6681 8.7247 5.3896 5.6889 5.2535 6.3800 5.2830 5.7404 1.0956 1.0871 1.0893 1.0882 1.0955 1.0887 1.0893 1.0908 1.0960 1.0986 1.0961 1.0940 1.0944 1.0974 1.0959 1.0936 1.0967 1.0666
irintensity: 10.3618 2.9889 9.0534 17.7068 9.3456 0.2665 2.7695 4.3686 1.3055 9.5957 14.5677 2.0484 2.8308 6.8606 3.6353 3.8882 0.9328 9.0593 6.5750 10.3064 1.6026 6.1329 0.7755 7.5779 30.5057 2.9336 14.0041 9.3004 12.3047 59.9963 10.7036 193.5402 10.9813 4.2430 0.0632 11.3968 17.1366 0.8217 2.7076 11.5704 6.9401 16.9669 1.5611 4.9127 2.5639 2.4132 79.4968 173.8279 3.3349 0.6405 7.2857 0.8151 14.6080 0.1373 59.5139 34.1107 86.1156 9.6461 27.1418 40.8187 61.0652 85.3928 58.1808 48.0118 8.6346 8.1646 77.0772 30.5383 2.3113 2.3444 64.7789 0.0306 37.3954 8.9833 176.9712 2.2018 0.0532 1.6479 5.3930 2.6774 0.0544 0.7497 1.2386 0.3375 0.0195 0.7657 0.0567 5.5784 0.7030 0.0407 3.2381 4.2483 38.1627 4.8637 15.0729 1.0758 7.6985 14.4176 2.2214 7.8796 4.1638 107.4897 7.9298 92.2326 54.9945 15.7839 20.8234 2.4400 87.5669 55.8195 222.8527 6.5671 12.0164 40.0782 32.3473 10.8182 439.5546 68.6951 62.1810 24.5836 17.0543 52.3418 9.0071 58.4771 16.5334 13.4564 94.0395 1282.5297 55.8078 6.0609 986.8811 795.4693 1.9032 16.0864 22.2049 4.5160 14.6630 2.7862 58.3227 0.1235 3.7837 2.4176 17.5094 2.5049 2.8477 2.9828 0.9275 24.7591 4.5129 1.6573 0.9277 0.4648 1.7128 9.7352 5.9140 99.1608
temp: 298.150 k
press: 1.00000 atm
elementType: 44 8 6 8 6 6 6 6 6 6 6 6 6 6 6 8 8 7 7 1 1 1 1 1 1 8 1 7 6 6 6 6 6 6 6 6 7 1 1 1 1 1 1 7 6 6 6 6 6 1 1 1 1 1
symmnumber: 1
zpe: 1035918.9 jmol-1
zpe.correction: 0.394561 hartree
zpe.thermalcorrener: 0.424985 hartree
zpe.thermalcorrenthalpy: 0.425929 hartree
zpe.thermalcorrgfe: 0.330899 hartree
zpe.sumelectzpe: -1707.134594 hartree
zpe.sumelectthermal: -1707.104170 hartree
zpe.sumelectthermalent: -1707.103226 hartree
zpe.sumelectthermalfe: -1707.198256 hartree
dipole: -9.0274 -2.9563 19.7049
dipole: 21.8750
quadrupole: -145.6379 -255.6131 -185.6022
quadrupole: -42.3018 19.0591 10.3070
quadrupole: 49.9798 -59.9953 10.0155 -42.3018 19.0591 10.3070
hfenergy: -1707.5291551 hartree
pointgroup: C01 [X(C25H18N5O5Ru1)]
dipole: 7.4259501 1.3910249 4.1217379 debye
polarizability: 586.9045743|-62.3584753|633.5183951|24.6486356|-38.7418604|617.5948414 unknown
InChI: InChI=1S/C12H6N2O4.C8H6N2.C5H5N.H2O.Ru/c15-11(16)9-5-1-3-7(13-9)8-4-2-6-10(14-8)12(17)18;1-2-4-8-7(3-1)5-6-9-10-8;1-2-4-6-5-3-1;;/h1-6H;1-6H;1-5H;1H2;/q-3;2*-1;;+6/p-1
charge 0 multiplicity 2
54 atoms
Ru -0.06699006 0.04967974 0.15449049
O  1.69225489 -3.68802694 0.07009787
C  1.39820733 -2.480378 0.13674735
O  0.18384613 -2.02080069 0.00802886
C  2.44080697 -1.42982875 0.37811444
C  3.79548839 -1.66038467 0.58833668
C  4.62254786 -0.56116966 0.84251409
C  4.08247284 0.72414015 0.88731557
C  2.71077565 0.89498079 0.66001994
C  1.9642521 2.15978867 0.66733494
C  2.55415985 3.39434356 0.92543937
C  1.76726748 4.5456447 0.90180848
C  0.41703243 4.42978854 0.59605853
C  -0.13161971 3.16871236 0.32445503
C  -1.598235 3.09922701 -0.08762455
O  -1.81295892 3.05986914 -1.33240193
O  -2.45103261 3.16457672 0.84442114
N  0.62233143 2.04692194 0.38198883
N  1.93565145 -0.18032804 0.40076937
H  4.18118453 -2.67254242 0.55861634
H  5.68346674 -0.70529831 1.01326945
H  4.71562216 1.57786396 1.0954606
H  3.6131634 3.45156125 1.14466984
H  2.2068973 5.51460669 1.11087397
H  -0.22787009 5.30019289 0.55246215
O  -2.01060879 0.07192086 -0.11956492
H  -2.48830069 0.04576899 0.72820136
N  -0.30793213 -0.09300401 2.22270953
C  -1.11738617 0.77739087 2.89834223
C  -1.32062407 0.66798259 4.25678203
C  -0.67304605 -0.36849205 4.95600617
C  -0.79637867 -0.60247253 6.35081401
C  -0.11405701 -1.65133004 6.92845761
C  0.71553356 -2.50399679 6.14768866
C  0.85842531 -2.303451 4.79353448
C  0.16304851 -1.22940812 4.17278143
N  0.3237169 -1.0690407 2.83042176
H  -1.58101718 1.55163355 2.29610588
H  -1.9687159 1.37129976 4.76862512
H  -1.42988282 0.05138887 6.94151203
H  -0.20628288 -1.83548317 7.99394617
H  1.23891583 -3.32200887 6.63183101
H  1.48460733 -2.94466539 4.18210522
N  0.08041577 0.10823765 -1.95245696
C  0.85917361 0.98079239 -2.63051947
C  0.9027212 1.01198935 -4.02040532
C  0.11697728 0.11478598 -4.74606377
C  -0.68453796 -0.78849231 -4.0462641
C  -0.67755873 -0.76416409 -2.65510607
H  1.45471845 1.66486818 -2.03903937
H  1.54264858 1.73394401 -4.51473257
H  0.12978808 0.1196365 -5.83087324
H  -1.31186009 -1.5071893 -4.56123497
H  -1.28507081 -1.44457281 -2.07171178
