program: Gaussian 09
title: /home/michael/molsimp_comfiles/Ru_oct_desorbed_1_OOH/Ru_oct_desorbed_1_OOH.com auto generated
version: ES64L-G09RevE.01
frameworkgroup: C1[X(C28H19N6O5Ru)]
method: UTPSSh
basis: Gen
operation: Freq
keyword: #P
keyword: Geom=AllCheck
keyword: Guess=TCheck
keyword: SCRF=Check
keyword: GenChk
keyword: UTPSSh/ChkBas
keyword: Freq
title: /home/michael/molsimp_comfiles/Ru_oct_desorbed_1_OOH/Ru_oct_desorbed_1
converged: YES YES YES YES
polarizability: 7.89280531e+02 -1.63322663e+00 7.33997409e+02 -4.40959557e+01 -1.73533318e+01 6.10807187e+02
1716.lowfreq: -15.8050 0.0004 0.0006 0.0008 8.9696 15.3364 19.9543 23.5976 28.2936
frequency: 17.6347 21.6622 23.0133 33.5700 35.9024 46.8378 51.2693 57.0032 67.1439 92.4802 98.9539 105.4652 128.4197 131.9713 146.1897 153.0150 160.8161 174.2434 180.3374 183.7075 190.2616 191.3810 208.3522 215.7469 236.7365 249.7142 261.3805 268.4269 280.3202 289.1907 312.8251 338.6648 357.3598 367.0380 368.7219 391.5569 392.8704 404.6684 415.2397 422.7329 444.2184 448.7732 476.7009 478.6875 496.1922 498.7119 504.3133 526.7321 529.6186 532.7522 545.8364 550.2657 575.2048 633.4054 638.4068 639.5747 648.8036 660.1774 664.4574 668.0767 681.3968 693.4749 734.3495 750.2063 755.6124 765.8966 767.2304 769.3806 781.6831 782.7271 791.0234 791.8921 792.2266 817.1768 827.9901 838.1306 846.3199 847.5096 848.8374 862.4769 871.9151 897.3127 901.1381 922.4411 943.7875 952.0371 972.9386 977.3376 991.5095 994.7368 1002.2033 1009.3942 1025.4213 1026.1831 1027.0678 1032.0384 1033.3295 1034.1579 1034.4551 1047.9371 1099.7507 1103.5334 1104.6424 1120.3676 1132.9410 1156.9972 1157.2997 1172.8268 1174.2298 1178.9040 1181.8094 1194.4024 1195.5326 1198.4008 1227.9554 1251.1431 1252.3312 1287.7125 1288.7493 1293.7333 1315.3414 1321.3718 1322.2499 1342.0375 1344.1979 1357.4506 1375.9200 1388.1894 1418.6616 1438.6483 1441.1659 1449.7552 1454.7250 1456.6944 1488.6895 1490.2615 1493.6408 1521.1987 1541.7642 1542.5088 1576.1765 1582.1504 1583.3508 1600.4019 1607.9799 1620.3675 1620.5755 1637.4110 1641.1741 1653.2283 1659.1273 1659.8433 3212.7852 3213.6920 3220.8631 3222.2715 3228.6616 3229.4643 3230.2782 3232.0467 3235.5087 3236.6013 3236.9347 3237.6055 3240.3549 3243.3302 3248.9597 3252.3113 3253.2938 3291.3750 3680.7570
redmass: 6.9603 6.8639 6.6160 6.7128 5.8559 5.2612 6.1036 7.8917 10.8753 7.2505 6.1513 10.3487 5.5209 7.2972 8.0983 5.8569 5.8308 5.9206 6.6658 6.0994 4.5732 4.7735 7.3694 7.2364 5.7243 5.6548 6.5212 6.3165 6.3938 10.4521 8.8495 7.5751 9.0435 1.9238 4.0530 3.7758 3.6955 4.2205 4.8418 9.1793 4.1418 3.9512 3.0996 3.1824 3.7490 3.8011 8.5550 5.2538 7.0284 7.1133 8.0437 8.0219 6.6598 14.3056 7.4659 7.3722 6.3388 7.4304 4.7810 4.6579 9.0277 8.4312 6.5175 2.3914 6.5900 2.4276 1.4048 1.4203 5.5551 5.5076 3.4803 3.6333 4.6520 1.5599 1.8524 2.6690 5.6967 3.0006 2.9203 1.4480 1.2990 1.4808 1.4763 6.4706 1.3769 1.4002 5.2481 5.0312 1.3227 1.3182 1.3497 1.3308 1.3712 1.3216 1.3227 1.3860 2.2990 2.7974 4.2157 7.3008 3.1351 2.5166 2.0935 1.7304 3.4299 1.4976 1.4908 1.1797 1.1752 1.7530 1.3548 1.7304 1.4737 1.4673 2.0291 3.0861 3.0959 1.7528 1.7555 3.9868 6.6358 2.9738 3.2297 2.9189 2.8940 3.1546 5.6676 7.8479 3.6520 6.7352 7.0565 2.7343 1.9731 1.9913 2.2370 2.2969 2.8825 3.5609 2.8922 2.8775 12.4444 6.6339 6.6618 6.8643 6.7827 5.6858 5.7399 5.5417 6.8104 12.6230 5.6066 5.6046 1.0875 1.0875 1.0895 1.0896 1.0922 1.0960 1.0960 1.0893 1.0985 1.0902 1.0984 1.0932 1.0998 1.0949 1.0935 1.0970 1.0978 1.0933 1.0662
irintensity: 7.2758 9.2509 9.7775 5.0120 1.1292 4.8639 3.5947 2.6781 6.9776 4.5352 1.1566 26.0658 3.2462 3.2810 2.4737 0.5911 6.9617 20.1779 14.0482 6.5774 12.7174 7.7177 9.7264 14.1723 19.9781 3.2208 4.0986 7.9856 21.0839 38.2799 4.7782 31.2496 16.9112 172.8772 86.5678 1.8595 4.0494 1.1355 0.9929 25.6266 9.0339 38.4116 8.5663 9.7827 0.2263 1.1565 24.8799 7.8299 0.6299 3.0174 17.2465 1.6755 9.2000 278.5544 14.2396 5.8837 22.6332 7.9100 3.4933 0.2994 50.6814 44.9983 20.0627 13.1483 67.3613 52.8204 48.2533 48.0921 30.2382 13.5260 15.1120 5.2519 63.8221 71.9308 86.2443 117.7145 11.9118 28.0166 2.8849 68.8703 66.9355 10.4777 19.1925 14.0977 0.1581 0.0848 3.4747 2.6911 0.7753 3.0207 4.4416 1.0212 0.8002 0.0148 0.0345 0.7855 5.8152 2.9052 12.2949 52.2236 16.4702 20.1325 32.0201 10.3501 2.5510 10.4520 11.8856 9.5185 8.5298 167.0243 2.6063 164.2294 8.7965 8.6493 17.8467 14.1621 13.2673 1.2980 4.9064 307.8648 175.6048 29.1092 54.2676 8.4683 7.8109 9.4957 40.0571 560.2645 77.1634 122.3927 107.2062 16.1615 20.2610 16.0833 13.0978 10.7429 100.5254 114.7980 34.0416 16.8731 1218.3355 129.5219 13.3751 8.3293 67.2952 45.5131 70.2112 34.0645 170.9353 1436.5340 17.8970 10.5485 0.9500 1.0389 3.7878 4.0353 29.9981 13.8794 13.5875 2.9452 17.7139 2.8780 15.6965 0.9723 12.9740 0.6197 2.5000 0.1435 0.8817 11.6892 478.5132
temp: 298.150 k
press: 1.00000 atm
elementType: 44 8 6 8 6 6 6 6 6 6 6 6 6 6 6 8 8 7 7 1 1 1 1 1 1 8 1 7 6 6 6 6 6 6 6 6 7 1 1 1 1 1 1 7 6 6 6 6 6 6 6 6 7 1 1 1 1 1 1
symmnumber: 1
zpe: 1126542.7 jmol-1
zpe.correction: 0.429077 hartree
zpe.thermalcorrener: 0.462063 hartree
zpe.thermalcorrenthalpy: 0.463007 hartree
zpe.thermalcorrgfe: 0.361776 hartree
zpe.sumelectzpe: -1876.565405 hartree
zpe.sumelectthermal: -1876.532420 hartree
zpe.sumelectthermalent: -1876.531476 hartree
zpe.sumelectthermalfe: -1876.632707 hartree
dipole: -6.7005 -2.1845 19.1206
dipole: 20.3781
quadrupole: -83.4671 -254.6190 -186.0358
quadrupole: -16.4877 12.0177 36.9253
quadrupole: 91.2402 -79.9117 -11.3285 -16.4877 12.0177 36.9253
hfenergy: -1876.9944828 hartree
pointgroup: C01[X(C28H19N6O5Ru1)]
dipole: -2.3661328 -1.0767981 7.5841899 debye
polarizability: 787.0696689|3.2476044|733.9633367|-46.0431408|-22.6175586|613.0521208 unknown
InChI: InChI=1S/C12H6N2O4.2C8H6N2.H2O.Ru/c15-11(16)9-5-1-3-7(13-9)8-4-2-6-10(14-8)12(17)18;2*1-2-4-8-7(3-1)5-6-9-10-8;;/h1-6H;2*1-6H;1H2;/q-3;2*-1;;+6/p-1
charge 1 multiplicity 3
59 atoms
Ru 0.10709457 0.01710933 -0.42282812
O  0.25572643 -4.01424224 0.35193113
C  0.16352144 -2.78448578 0.3965196
O  0.34115838 -2.00657032 -0.64723054
C  -0.15808532 -2.0393137 1.65543313
C  -0.41918135 -2.61269465 2.89103648
C  -0.75867738 -1.76348059 3.95107237
C  -0.83508193 -0.38507535 3.75204351
C  -0.55093009 0.13490868 2.48476887
C  -0.5815324 1.54391886 2.08479481
C  -0.90619254 2.59196839 2.93858977
C  -0.89664086 3.89770478 2.44141685
C  -0.54860223 4.11754746 1.11522007
C  -0.20325746 3.03130452 0.29634891
C  0.25258518 3.29585611 -1.13631229
O  -0.64342137 3.68595074 -1.93578338
O  1.48695844 3.15059314 -1.35356862
N  -0.23830549 1.77297593 0.7783422
N  -0.20510684 -0.70396262 1.48202051
H  -0.36749409 -3.68828325 3.00908943
H  -0.97380568 -2.17717692 4.92969421
H  -1.11245553 0.27400255 4.56511345
H  -1.16523251 2.39076959 3.97049083
H  -1.15505765 4.72822668 3.08866654
H  -0.52431609 5.11609313 0.69459705
O  0.25996882 0.43453034 -2.2694973
H  0.31007299 -0.37350132 -2.82088765
N  -1.99180412 -0.18912578 -0.64562413
C  -2.68913166 0.81289952 -1.25184777
C  -4.0459164 0.69979993 -1.46415047
C  -4.69872335 -0.47368155 -1.04448843
C  -6.08620627 -0.72108208 -1.20658283
C  -6.61978597 -1.91185707 -0.76356631
C  -5.80259974 -2.89835344 -0.14297912
C  -4.45398808 -2.69075282 0.03368709
C  -3.8784723 -1.47102496 -0.41664761
N  -2.54189945 -1.29853465 -0.2355384
H  -2.11194779 1.67783747 -1.55430669
H  -4.58876939 1.5030403 -1.95001938
H  -6.70448072 0.0339142 -1.68077856
H  -7.6798238 -2.10776213 -0.88764171
H  -6.2557512 -3.82522367 0.19244866
H  -3.81607736 -3.43130074 0.50358531
N  2.19895801 0.11822814 -0.07737798
C  2.76218817 0.82469688 0.94384139
C  4.12748063 0.84557343 1.12965104
C  4.94193224 0.12834022 0.23554394
C  6.35723233 0.06380638 0.30905369
C  7.05153633 -0.6732443 -0.6256203
C  6.37318366 -1.37115007 -1.66507625
C  5.00207295 -1.33016606 -1.76613576
C  4.2614975 -0.57829811 -0.81236668
N  2.90882153 -0.56800565 -0.93464455
H  2.08546291 1.36042051 1.59409656
H  4.55376155 1.41061675 1.95105836
H  6.86985159 0.5972105 1.1026354
H  8.13408077 -0.72771126 -0.5745938
H  6.95199348 -1.94162936 -2.38372432
H  4.46748351 -1.85566 -2.54990122
