program: Gaussian 09
title: /home/michael/molsimp_comfiles/Ru_3a1_9_OH/Ru_3a1_9_OH.com auto generated
version: ES64L-G09RevE.01
frameworkgroup: C1[X(C26H19N5O3Ru)]
method: UTPSSh
basis: Gen
operation: Freq
keyword: #P
keyword: Geom=AllCheck
keyword: Guess=TCheck
keyword: SCRF=Check
keyword: GenChk
keyword: UTPSSh/ChkBas
keyword: Freq
title: /home/michael/molsimp_comfiles/Ru_3a1_9_OH/Ru_3a1_9_OH.com auto genera
converged: YES YES NO YES
polarizability: 6.39862961e+02 8.36018661e+01 7.24298357e+02 4.08665078e+01 3.41964397e+01 5.59082786e+02
1716.lowfreq: -10.1159 -0.0004 0.0004 0.0009 8.7781 14.7064 17.9036 24.9240 28.1242
frequency: 16.0750 17.5242 27.6327 32.9772 38.3588 44.9388 65.9212 77.2261 108.7878 128.0794 131.9056 150.7885 159.6315 169.4011 173.1208 180.5350 183.6239 191.2513 217.6599 228.6913 236.6161 247.3063 264.9681 279.2993 296.9281 302.2610 314.5347 339.1540 353.0544 390.7569 391.5073 409.3808 452.9728 463.5351 470.5521 477.3383 502.0941 508.9408 513.9659 532.0698 535.5716 542.0169 546.5018 552.1654 590.6301 606.4920 614.3486 637.5071 643.1592 648.3756 650.4761 655.8980 666.2452 692.8080 695.8436 731.3905 738.6719 741.0834 758.5551 765.5528 766.1415 771.8848 784.1650 788.3446 791.5235 845.3484 845.9335 846.5380 856.9443 857.9674 881.6162 890.7749 894.0100 945.2246 950.4614 958.9181 974.4054 985.3597 986.1085 994.0935 997.8432 1003.2587 1020.6220 1026.6560 1035.0234 1035.7630 1043.7908 1048.6162 1064.2769 1071.9926 1088.0600 1094.1291 1097.5893 1099.9253 1155.6544 1157.6494 1170.4437 1170.4874 1178.2706 1181.6621 1183.8087 1222.7761 1236.1657 1242.6720 1251.8511 1273.2270 1285.1311 1293.1586 1311.8204 1322.7711 1326.7240 1335.1850 1347.4177 1365.2939 1374.8358 1405.6130 1430.6706 1438.2548 1453.4728 1464.6433 1481.5043 1482.2462 1483.5038 1502.7593 1516.4021 1521.7220 1539.7431 1558.6516 1584.1229 1589.6349 1620.0630 1626.7703 1633.1256 1650.7157 1653.7357 1662.7367 1668.6417 3189.6477 3192.2373 3197.4483 3207.6365 3208.3539 3208.3644 3214.6464 3219.3589 3222.3029 3223.6474 3230.6865 3231.0109 3231.9182 3232.1388 3236.6013 3246.8362 3249.8943 3274.7672 3627.5407
redmass: 6.0782 3.7818 6.0880 5.6437 4.7307 5.5597 5.3527 5.7619 4.8413 7.0450 6.6122 7.3308 6.5975 8.3053 7.1233 4.2956 6.5344 8.1532 7.4784 6.5348 7.7240 7.7371 10.6942 9.2597 6.0026 8.7092 8.5522 8.8770 6.3716 2.6731 3.5754 4.7662 4.0092 3.3071 10.3210 3.0859 3.8375 1.3387 7.5528 6.7061 2.9808 7.9868 4.0717 7.9470 7.7919 7.5359 4.8921 7.3196 6.7979 6.5495 6.3282 5.5351 4.3093 2.6127 2.3774 2.2414 6.8122 2.5659 2.6478 1.3998 1.4865 1.7749 5.6751 14.4449 3.8238 5.5794 4.7922 1.5270 1.3749 1.4562 1.2594 1.5078 6.2291 1.3392 1.2444 1.3315 5.1502 1.3231 1.2682 1.4246 1.3630 8.1542 1.3138 1.3133 2.5809 4.8150 1.8867 6.8302 2.1484 3.9905 1.7579 2.9598 3.0867 1.9909 1.5066 1.5618 1.0776 1.2335 1.2642 1.2927 1.3454 1.2216 2.9174 2.9393 1.7938 2.7454 1.7801 2.5489 2.6859 2.8858 7.3717 3.1002 3.8889 2.7712 1.2415 5.7701 3.5584 6.0660 2.0414 2.5985 2.2836 3.4116 2.3978 2.6067 1.9834 3.4839 3.1018 5.7803 6.6506 6.1442 5.5514 5.8600 6.5682 5.3823 5.3558 5.7656 9.0484 1.0873 1.0856 1.0887 1.0929 1.0930 1.0879 1.0895 1.0883 1.0976 1.0954 1.0931 1.0985 1.0899 1.0942 1.0949 1.0953 1.0987 1.0949 1.0818
irintensity: 0.8410 0.5842 6.2838 2.0984 3.7487 6.8045 0.4641 0.1071 0.4764 1.3736 4.5464 4.2580 8.0674 0.6672 12.1921 13.8436 1.1371 16.2693 15.2794 6.0818 5.2855 6.0892 48.2147 5.5504 19.8271 26.6241 5.3206 78.5673 9.4090 0.1114 2.6896 9.2233 7.4763 8.8224 7.4331 8.0322 1.2845 176.8542 109.0342 4.7064 5.2440 1.4828 3.4764 21.2367 5.4093 10.4718 6.5269 7.8860 3.1976 15.9191 0.7950 5.3054 0.0748 41.3367 46.2166 19.1518 10.5934 90.1376 16.7315 71.2272 79.8224 26.0428 24.1129 426.1576 7.4652 50.4612 47.0049 12.4389 71.0065 11.0141 0.1683 6.4400 3.9042 4.0902 1.3692 1.1372 2.1932 0.6319 0.3876 0.0356 4.8363 6.8807 0.0190 0.1270 7.1722 2.0403 11.6736 1.2484 21.2429 79.5259 23.5029 25.4305 39.4136 10.9409 5.0809 81.5534 2.9096 8.6186 1.2647 18.6165 2.9751 26.2604 149.3549 17.0587 27.6729 519.6210 5.0664 96.6135 12.6168 91.4395 1.6670 12.5395 93.9193 31.4859 7.8617 168.3333 106.8800 63.6888 11.2830 267.2215 52.6928 18.1019 18.4710 426.3828 7.7638 9.0079 36.2799 180.5886 45.9486 90.7104 2.9894 33.8974 67.3868 262.8909 25.7641 2.4790 236.5246 14.0343 6.6815 8.3108 38.8859 32.2698 4.7850 3.9029 3.5401 44.8845 16.1621 4.2503 22.9285 2.6373 17.4661 0.7045 9.2758 13.5798 12.9752 277.3527
temp: 298.150 k
press: 1.00000 atm
elementType: 44 8 6 6 6 6 6 6 6 7 6 6 6 6 6 8 6 7 1 1 1 1 1 1 1 1 8 7 6 6 6 6 6 6 6 6 7 1 1 1 1 1 1 7 6 6 6 6 6 1 1 1 1 1
symmnumber: 1
zpe: 1061379.2 jmol-1
zpe.correction: 0.404258 hartree
zpe.thermalcorrener: 0.432760 hartree
zpe.thermalcorrenthalpy: 0.433705 hartree
zpe.thermalcorrgfe: 0.342197 hartree
zpe.sumelectzpe: -1595.305409 hartree
zpe.sumelectthermal: -1595.276907 hartree
zpe.sumelectthermalent: -1595.275963 hartree
zpe.sumelectthermalfe: -1595.367470 hartree
dipole: 1.5881 8.4424 9.6024
dipole: 12.8842
quadrupole: -114.5731 -191.2898 -209.1341
quadrupole: -12.7950 -5.4740 13.8888
quadrupole: 57.0926 -19.6242 -37.4684 -12.7950 -5.4740 13.8888
hfenergy: -1595.7096674 hartree
pointgroup: C01 [X(C26H19N5O3Ru1)]
dipole: -0.6802117 3.3628035 -3.7314935 debye
polarizability: 642.707243|-85.5499622|722.3364504|40.2735093|-31.2410871|558.2004107 unknown
InChI: InChI=1S/C13H8N2O2.C8H6N2.C5H5N.O.Ru/c16-10-6-2-1-4-8(10)13-14-9-5-3-7-11(17)12(9)15-13;1-2-4-8-7(3-1)5-6-9-10-8;1-2-4-6-5-3-1;;/h1-7,14H;1-6H;1-5H;;/q-3;2*-1;;+5
charge 0 multiplicity 3
54 atoms
Ru -0.19715248 -0.54306148 0.9128703
O  -0.65245299 1.42328587 1.44176788
C  -1.16349566 2.43444622 0.72244885
C  -1.35911942 3.648398 1.43052338
C  -1.87250704 4.78438306 0.82202471
C  -2.22286583 4.77342746 -0.53986521
C  -2.04749155 3.60714225 -1.2662589
C  -1.52729445 2.43196364 -0.67555823
C  -1.35496569 1.22975909 -1.45756243
N  -1.66014314 0.96681447 -2.77928631
C  -1.3169246 -0.36427877 -3.06747064
C  -1.37513762 -1.24240229 -4.16069777
C  -0.90139491 -2.54242096 -3.9099447
C  -0.3924143 -3.00547829 -2.66958562
C  -0.33455883 -2.12332625 -1.57499891
O  0.0921725 -2.33796095 -0.31589023
C  -0.80256591 -0.84022096 -1.86611897
N  -0.83084408 0.13702542 -0.91559815
H  -1.08866964 3.65942225 2.48223193
H  -2.00167598 5.6888428 1.40957107
H  -2.62297628 5.6615592 -1.01731673
H  -2.3111493 3.58911396 -2.32019619
H  -2.07195309 1.62909903 -3.42598691
H  -1.75863776 -0.95911636 -5.13381728
H  -0.93049977 -3.25455832 -4.73033717
H  -0.05827771 -4.03454746 -2.57776827
O  0.33424541 -1.28819164 2.46058244
N  1.77141723 0.08741112 0.47408723
C  2.01126365 1.28917972 -0.12832731
C  3.28783567 1.70673572 -0.43193162
C  4.3682194 0.8681263 -0.09934373
C  5.73238449 1.17394341 -0.34470485
C  6.70869898 0.27680597 0.03063105
C  6.36928229 -0.95356681 0.65993464
C  5.05582438 -1.28148118 0.90874923
C  4.02908872 -0.37248908 0.53211033
N  2.74207877 -0.73277401 0.79381296
H  1.13870967 1.88685311 -0.35093979
H  3.44752112 2.66513258 -0.91417726
H  5.98420855 2.11440237 -0.82428276
H  7.75356804 0.50570816 -0.15268733
H  7.16129655 -1.63808624 0.94538507
H  4.7795902 -2.21474391 1.38796228
N  -2.18392048 -1.18612861 1.30066222
C  -2.37982808 -2.46969346 1.67658656
C  -3.64794374 -2.97757782 1.93763937
C  -4.75637227 -2.13903241 1.80312181
C  -4.55145522 -0.81504979 1.41187881
C  -3.25435046 -0.37303136 1.17064248
H  -1.48999327 -3.08032148 1.76684377
H  -3.75381817 -4.01320503 2.23994014
H  -5.75722991 -2.50899443 1.99934229
H  -5.37791766 -0.12346664 1.29463951
H  -3.05580135 0.64857684 0.87353397
