program: Gaussian 09
title: /home/michael/molsimp_comfiles/Ru_3a1_4_OH/Ru_3a1_4_OH.com auto generated
version: ES64L-G09RevE.01
frameworkgroup: C1[X(C33H26N5ORu)]
method: UTPSSh
basis: Gen
operation: Freq
keyword: #P
keyword: Geom=AllCheck
keyword: Guess=TCheck
keyword: SCRF=Check
keyword: GenChk
keyword: UTPSSh/ChkBas
keyword: Freq
title: /home/michael/molsimp_comfiles/Ru_3a1_4_OH/Ru_3a1_4_OH.com auto genera
converged: YES YES NO YES
polarizability: 7.06673790e+02 -7.11575909e+00 8.28145127e+02 -1.32981116e+01 -6.82816477e+01 6.20992189e+02
1716.lowfreq: -8.2901 -0.0006 -0.0004 0.0007 6.9966 14.7239 19.8133 23.8712 33.9877
frequency: 18.4813 23.5437 33.8465 35.6183 39.9002 46.3166 49.7301 72.2658 97.7269 114.3487 116.4680 125.0627 131.9242 151.7400 159.8805 170.6126 177.7145 181.4482 184.5038 187.8866 195.2618 230.1226 240.0278 255.9309 261.6744 282.8573 286.1013 306.4214 312.5604 346.4844 355.2144 375.1007 383.0339 395.1107 398.3884 399.8934 429.3313 440.4462 454.9244 460.1841 475.8648 479.5429 481.3186 491.2911 499.4354 523.7797 525.2364 526.6702 540.2303 541.7313 547.5036 565.1384 630.3265 641.9799 643.0647 646.1497 647.1096 648.4289 648.9785 653.1872 670.5563 731.1564 738.4127 754.1128 759.5313 762.4958 764.9687 776.1339 777.1707 780.3167 790.8813 791.7753 795.1955 832.1698 833.3911 836.0988 839.6868 840.2991 840.9477 887.6453 891.6186 909.5890 918.9298 923.4466 936.7911 947.7827 952.8262 967.1878 967.7189 972.5525 975.2722 986.3268 986.9871 990.6906 996.1625 1014.8439 1016.0196 1017.4560 1025.2024 1027.5200 1032.0778 1035.4312 1039.6152 1040.6191 1048.0618 1051.1757 1066.7529 1074.1132 1076.2500 1092.2758 1117.5469 1129.6938 1144.2232 1156.9398 1157.9732 1160.3652 1175.3744 1176.3233 1180.8578 1187.9042 1203.8770 1208.1615 1222.5153 1250.7716 1253.3170 1281.5473 1285.0529 1296.1665 1301.7427 1304.8721 1314.9763 1321.4024 1326.9458 1339.8360 1356.7326 1371.0276 1373.1104 1378.0541 1415.1799 1420.6388 1426.1378 1432.6900 1433.5737 1471.6647 1475.5947 1478.1258 1484.6462 1489.4848 1496.3844 1499.1821 1511.7618 1535.0437 1545.0596 1546.4341 1597.9821 1607.0526 1608.0499 1609.8514 1613.5534 1642.8164 1642.9216 1646.0552 1647.1371 1649.4241 1672.8096 1673.0855 3200.3122 3202.3467 3204.6246 3207.5895 3214.8131 3215.9540 3217.1700 3220.7681 3224.3231 3224.7431 3225.8203 3226.8494 3229.8544 3231.6793 3232.2973 3237.4060 3241.2103 3241.6045 3247.2599 3250.0844 3251.4254 3252.1746 3255.1825 3260.2990 3261.4834 3719.9656
redmass: 6.3667 5.6120 4.4065 6.1228 4.3887 5.2205 5.7235 5.2068 4.2340 5.3192 5.4521 4.4807 6.2665 6.0880 4.9160 6.0078 5.1628 5.0749 4.2899 5.0388 5.6066 5.9991 4.8086 5.6406 5.1025 6.2766 9.2769 7.1832 6.3175 6.8778 6.6589 1.9736 1.8008 3.1777 3.0791 4.1359 3.4554 3.6191 6.5850 4.0828 4.1885 2.8428 2.8081 3.4308 3.7642 4.2032 6.6515 4.7229 7.8134 5.4892 7.7139 11.9615 3.8936 6.5533 6.1695 6.9575 3.8516 6.5538 6.8866 3.6540 6.8218 6.7319 4.6090 2.0051 2.2526 1.2618 1.2478 3.8205 3.8978 1.2215 4.6830 4.4844 1.8068 2.3672 5.7099 6.2498 1.4595 4.0718 1.4452 1.4063 1.3877 1.3240 1.2762 1.1443 1.4060 1.4644 1.4037 4.4721 4.8909 1.3136 1.3138 1.3802 1.3823 1.3788 1.3710 1.3278 1.3020 1.3004 1.3264 1.3256 7.6651 7.7808 2.3551 2.3843 6.3882 7.8293 2.6681 2.5707 2.5399 1.9751 1.9435 1.6286 1.7046 1.4832 1.4914 1.6145 1.1116 1.1089 1.1065 1.1341 1.3892 1.4116 1.3362 2.1760 2.2239 1.6519 1.6536 1.8134 1.8684 2.3510 1.9023 3.6197 5.3253 2.0116 4.0006 2.7442 3.7673 3.9860 1.6705 1.6045 2.1767 7.3032 7.3065 2.1097 2.5654 2.5624 2.2654 2.4607 2.0047 1.9582 2.7358 3.0611 3.1861 3.1810 5.8097 6.2235 6.2220 5.6440 5.8813 5.1332 5.0522 5.2046 5.2349 6.1818 6.0796 5.9929 1.0868 1.0866 1.0891 1.0891 1.0950 1.0921 1.0951 1.0914 1.0912 1.0982 1.0984 1.0893 1.0893 1.0918 1.0899 1.0910 1.0916 1.0955 1.0939 1.0953 1.0988 1.0987 1.0958 1.0941 1.0939 1.0664
irintensity: 0.2051 0.2604 0.2410 0.0617 0.0172 1.2768 5.5053 0.7320 0.1422 1.4498 0.1143 0.6078 0.4305 2.0327 0.5045 4.6488 1.0044 3.8380 0.4583 0.2240 0.9497 0.4211 1.6439 0.2013 1.1447 6.0313 14.3643 3.4481 8.9807 4.4318 0.2219 92.8222 118.1276 0.5974 3.4199 11.7914 0.7797 14.7501 1.8032 0.6783 8.1911 10.9088 32.6301 1.4391 10.7331 3.1764 0.6359 5.2541 6.7579 2.5599 12.6435 196.7627 0.4027 15.9615 4.1903 4.0720 0.4263 9.7285 7.0503 16.8415 0.3328 2.6223 19.5800 1.4008 0.8539 22.4461 47.6574 0.8551 4.6361 263.0967 3.8338 4.8627 1.6229 2.7727 0.2390 0.0870 16.7148 4.9606 152.4078 13.8610 14.8641 1.7046 21.8886 168.7485 0.0432 7.6606 12.7290 0.8969 0.6223 0.1086 0.0982 2.7088 6.9510 8.9819 2.4801 0.2827 0.0121 0.0261 0.0167 0.1164 5.0731 0.4337 10.3019 9.7045 0.5920 0.7452 42.6677 2.0911 5.4969 0.4035 13.1900 1.9241 2.3012 3.6683 4.1766 0.8618 4.3087 3.9519 3.3456 7.3924 10.5507 3.3902 5.5699 13.1641 6.9898 4.0429 4.1788 11.7434 9.8062 13.7656 25.9168 13.6317 35.1684 23.4373 11.0850 0.7382 0.2535 5.9391 39.5712 50.7339 22.0039 40.8386 38.2887 3.3004 7.9120 2.8214 198.2692 2.7002 5.8705 4.1638 64.8832 3.0057 5.7513 20.7720 7.9172 6.4198 1.6029 12.3581 22.4273 7.5333 15.8515 27.9859 41.6224 3.6684 26.5172 59.4766 1.3089 0.4379 0.5945 1.4285 28.0490 2.2133 26.6578 2.9835 3.1982 33.7265 30.7100 3.2034 4.3547 0.6298 3.8034 0.1686 1.2044 0.0798 0.2444 1.6935 2.4763 6.5632 1.4617 9.2904 18.0582 106.3238
temp: 298.150 k
press: 1.00000 atm
elementType: 44 6 6 6 6 6 6 6 6 6 6 6 6 6 6 7 7 7 6 1 1 1 1 1 1 1 1 1 1 1 8 1 7 6 6 6 6 6 6 6 6 6 1 1 1 1 1 1 1 7 6 6 6 6 6 6 6 6 6 1 1 1 1 1 1 1
symmnumber: 1
zpe: 1368624.8 jmol-1
zpe.correction: 0.521282 hartree
zpe.thermalcorrener: 0.553278 hartree
zpe.thermalcorrenthalpy: 0.554222 hartree
zpe.thermalcorrgfe: 0.457000 hartree
zpe.sumelectzpe: -1715.527036 hartree
zpe.sumelectthermal: -1715.495039 hartree
zpe.sumelectthermalent: -1715.494095 hartree
zpe.sumelectthermalfe: -1715.591317 hartree
dipole: -2.3015 -3.2679 6.7474
dipole: 7.8424
quadrupole: -134.5986 -123.9559 -178.1688
quadrupole: -2.9666 3.1716 -1.7945
quadrupole: 10.9758 21.6185 -32.5944 -2.9666 3.1716 -1.7945
hfenergy: -1716.0483173 hartree
pointgroup: C01 [X(C33H26N5O1Ru1)]
dipole: 2.9538815 -0.4508287 -0.7689863 debye
polarizability: 750.9943818|120.5027512|699.4155441|-7.4593669|18.7697906|705.4011801 unknown
InChI: InChI=1S/C15H11N3.2C9H7N.H2O.Ru/c1-3-10-16-12(6-1)14-8-5-9-15(18-14)13-7-2-4-11-17-13;2*1-2-4-9-7-10-6-5-8(9)3-1;;/h1-11H;2*1-7H;1H2;/q-3;2*-1;;+6/p-1
charge 2 multiplicity 2
66 atoms
Ru 0.03261339 0.32808825 0.10271641
C  0.53989802 4.66338763 0.25355139
C  1.92737064 4.80692853 0.27788802
C  2.7306129 3.6674064 0.25340033
C  2.13097381 2.40793949 0.2040501
C  2.86503844 1.13247664 0.16979471
C  4.2531868 0.97132276 0.17235712
C  4.77972416 -0.32025005 0.13420691
C  3.92960894 -1.42607605 0.09531114
C  2.54914414 -1.21397987 0.0955508
C  1.50747473 -2.24903762 0.05955602
C  1.75550981 -3.62192653 0.04331095
C  0.68043952 -4.51015894 0.02016525
C  -0.62043436 -4.0066458 0.01531497
C  -0.8093936 -2.62662476 0.03138407
N  0.22857927 -1.76872646 0.04940158
N  2.05194863 0.04679657 0.13149706
N  0.76740781 2.28181826 0.17961789
C  -0.00690414 3.38419614 0.2049399
H  -0.12075103 5.52204813 0.27115421
H  2.38154858 5.79076642 0.31525579
H  3.81028309 3.75352582 0.27156529
H  4.90831524 1.83290814 0.20411854
H  5.85398797 -0.46485585 0.13474057
H  4.33163803 -2.43097791 0.0658575
H  2.77513148 -3.98812612 0.05128423
H  0.85967691 -5.57956874 0.00820367
H  -1.48355842 -4.66138982 0.00046931
H  -1.79787109 -2.18233107 0.03102357
H  -1.07565215 3.21012646 0.1853532
O  -1.86355205 0.82784693 0.14926384
H  -2.19882342 1.00819171 -0.74808282
N  -0.11029706 0.25607743 2.21297944
C  0.83086032 0.81076013 3.04736295
C  0.70431159 0.79800885 4.41383277
C  -0.42988124 0.19617997 5.01844812
C  -0.64187417 0.14855018 6.42043594
C  -1.77737728 -0.45462426 6.92364583
C  -2.74226226 -1.03342432 6.05804521
C  -2.56286904 -1.00430279 4.69124398
C  -1.40367363 -0.38761546 4.14746498
C  -1.18170582 -0.32451819 2.75220431
H  1.68876726 1.26736776 2.572381
H  1.47528997 1.2533697 5.0263956
H  0.09549207 0.59168472 7.08269729
H  -1.94009974 -0.48898606 7.99647273
H  -3.6260027 -1.49998798 6.48123138
H  -3.2948308 -1.44223636 4.01920969
H  -1.90476066 -0.7509847 2.0657105
N  -0.01334392 0.34987884 -2.01534744
C  0.89853341 1.03480573 -2.78389753
C  0.8758026 1.00693548 -4.15595884
C  -0.11341449 0.2525213 -4.8388758
C  -0.20042274 0.16398115 -6.25206206
C  -1.19397719 -0.59923851 -6.83251843
C  -2.13693954 -1.30049072 -6.03601676
C  -2.07889575 -1.23234821 -4.66018752
C  -1.06520694 -0.45456373 -4.03807363
C  -0.95855105 -0.36258406 -2.63130314
H  1.64832154 1.60488744 -2.25228756
H  1.62096136 1.56449995 -4.71355573
H  0.52082514 0.69964559 -6.86152162
H  -1.25942924 -0.66811473 -7.91396321
H  -2.90675041 -1.89321612 -6.51957369
H  -2.79417354 -1.76502138 -4.04072818
H  -1.66484515 -0.89442333 -2.0016051
