program: Gaussian 09
title: /home/michael/molsimp_comfiles/Ru_3a1_22_OH/Ru_3a1_22_OH.com auto generated
version: ES64L-G09RevE.01
frameworkgroup: C1[X(C29H22N4O3Ru)]
method: UTPSSh
basis: Gen
operation: Freq
keyword: #P
keyword: Geom=AllCheck
keyword: Guess=TCheck
keyword: SCRF=Check
keyword: GenChk
keyword: UTPSSh/ChkBas
keyword: Freq
title: /home/michael/molsimp_comfiles/Ru_3a1_22_OH/Ru_3a1_22_OH.com auto gene
converged: YES YES NO YES
polarizability: 6.87977578e+02 -3.40697755e+00 7.38223425e+02 -1.37299210e+00 -1.56378005e+00 5.31499789e+02
1716.lowfreq: -6.2646 -0.0009 -0.0005 0.0005 9.9223 11.6976 18.9738 26.0606 26.9382
frequency: 16.7554 20.3398 25.9489 34.8355 37.5206 48.5099 53.1481 72.3211 105.3843 113.1074 123.7152 132.1882 153.0375 163.4874 168.5448 170.3119 179.3177 186.2581 198.4293 200.9036 201.4979 232.6959 254.5991 272.3210 279.9047 302.7255 309.0195 312.2932 353.9545 377.7177 392.4371 392.6165 395.3834 401.0435 406.9344 435.1980 464.6007 476.6850 477.9185 478.6962 489.7135 499.2786 501.3989 525.3616 525.5505 538.8808 545.9735 568.1241 570.4619 580.6937 641.3163 642.3694 645.9108 646.7514 652.6905 660.9873 691.0213 720.8867 755.6800 764.1291 765.0817 767.9814 774.0906 775.5390 776.2383 789.0764 790.5760 793.2164 832.1629 835.2947 841.4444 844.6336 845.6032 882.7156 889.6025 890.3568 902.6492 913.5178 937.9243 940.4876 953.1676 964.3865 965.8724 975.3649 977.8093 988.9330 989.4524 992.5274 1016.8825 1017.0264 1023.1390 1025.3108 1033.7888 1040.4786 1040.6384 1050.0371 1062.9484 1064.2235 1071.0996 1093.1301 1107.5349 1139.2088 1157.4687 1157.7878 1175.6931 1175.9751 1176.0894 1182.2248 1200.5498 1202.5898 1206.4175 1249.3279 1251.6343 1283.3050 1284.1913 1294.1094 1296.2387 1300.6132 1310.0251 1319.0800 1352.2037 1366.3702 1373.4708 1378.8591 1413.1881 1417.0465 1429.2626 1431.6309 1431.9440 1475.2265 1477.2820 1479.6396 1491.1044 1496.1595 1498.0924 1519.8657 1544.9149 1546.3286 1598.7566 1606.3702 1607.5292 1608.5553 1613.4451 1642.4440 1642.5366 1643.8313 1647.9216 1673.3148 1673.6366 3201.4599 3201.5159 3207.1039 3207.3716 3216.2478 3216.3271 3221.0169 3223.1775 3223.2430 3224.8719 3225.1892 3228.9499 3229.5112 3232.7541 3239.8016 3242.6716 3245.4626 3248.9446 3255.7504 3258.0444 3259.0408 3731.2305
redmass: 4.9928 6.6780 5.4067 5.8104 4.4322 5.7830 7.5327 6.2560 4.1624 5.9298 6.3634 6.4473 6.7775 5.0744 6.4063 6.9816 4.0648 3.9557 5.9611 6.7179 6.6364 7.1419 5.9372 4.9607 6.9914 8.8273 8.2835 7.8289 8.4026 3.6728 5.3220 2.3746 2.6778 1.9944 3.0921 3.5805 4.4514 3.2534 3.3651 2.7534 3.5355 5.4699 5.0933 6.8280 6.8071 7.9075 7.7313 7.1347 4.2080 9.8342 6.6535 6.4636 3.5763 7.0798 3.5206 6.9736 8.0886 5.9253 2.0524 1.2494 1.2808 8.6697 2.0834 3.4008 3.6034 4.7034 4.7264 2.0011 5.9155 6.0645 1.4013 2.2546 1.3587 7.5353 1.3755 1.3858 1.1490 1.3323 1.4504 1.4747 1.3917 5.1036 5.1885 1.3117 1.3037 1.3686 1.3689 1.3778 1.2976 1.2986 1.3330 1.3210 7.7268 2.4056 2.3768 7.1142 2.6461 2.8228 2.6192 2.4677 1.5905 1.8314 1.5049 1.4942 1.0854 1.1114 1.1106 1.4169 1.3665 2.1217 1.4003 2.1686 2.1890 1.6243 1.6392 1.8344 1.8292 2.4169 2.5972 5.6351 3.5510 4.6107 3.6627 3.8733 1.7155 1.6443 2.5407 7.1229 7.1704 2.5726 2.5676 2.3948 2.4610 2.0053 1.9773 3.4019 3.1826 3.1892 5.8995 6.2434 6.3786 6.7368 10.4821 5.1434 5.1339 5.7274 6.5236 6.0326 6.0625 1.0864 1.0864 1.0890 1.0889 1.0953 1.0953 1.0923 1.0910 1.0911 1.0984 1.0984 1.0920 1.0889 1.0891 1.0922 1.0929 1.0963 1.0982 1.0976 1.0942 1.0945 1.0665
irintensity: 1.0506 3.2860 0.4154 0.6101 0.2989 7.4792 6.0668 0.7621 3.5635 1.7954 0.8117 0.3615 2.9635 2.2194 0.4871 2.3525 1.3160 3.1846 1.0647 6.4178 13.9525 11.3702 1.4038 5.1397 2.8990 41.8232 10.2940 14.8671 4.7420 14.0508 49.4472 66.5602 23.3165 49.9884 58.8391 12.3712 4.9667 14.2749 4.9509 30.3483 1.0343 1.3127 19.5266 0.3458 0.5587 2.5501 17.8380 61.6674 7.6225 177.6395 16.4648 2.0168 1.0075 2.0537 19.5433 11.4039 22.0317 41.7117 0.9859 4.4806 63.8587 54.0624 104.2479 13.0580 11.4035 0.3064 0.5585 47.6233 2.5408 0.1518 56.0046 10.4717 102.9454 21.8913 13.4372 22.5072 187.1155 6.0114 4.5079 12.2307 0.0042 0.8644 2.1556 0.0798 0.3630 6.2822 6.2412 2.3389 0.0177 0.0175 0.0851 0.2155 1.1050 12.4633 7.4463 0.1881 36.4371 3.9599 2.1951 9.5692 9.4421 7.6880 3.3940 3.8958 2.0839 5.1072 2.9839 35.5962 8.2440 98.3702 4.8240 13.4920 7.7286 4.2327 4.1783 13.0460 10.9758 95.2207 154.2342 23.0673 52.6277 83.6575 0.3098 6.5508 34.3770 46.5469 24.3991 41.1283 28.6988 8.6411 1.0171 0.9927 172.7539 5.3426 3.0144 0.4679 5.6288 23.2031 9.5239 8.3987 3.0674 384.7917 1327.2961 0.8030 19.8538 15.9569 6.9314 26.2571 47.0360 0.4468 0.1958 1.2865 1.3907 29.7369 29.6676 0.5256 2.9887 5.5590 33.3419 32.0957 0.4712 3.0948 1.8996 0.2113 0.0882 0.2501 1.6558 6.4495 10.3377 17.7636 85.1663
temp: 298.150 k
press: 1.00000 atm
elementType: 44 8 6 8 6 6 6 6 6 6 6 6 6 6 7 7 1 1 1 1 1 1 1 8 1 7 6 6 6 6 6 6 6 6 6 1 1 1 1 1 1 1 7 6 6 6 6 6 6 6 6 6 1 1 1 1 1 1 1
symmnumber: 1
zpe: 1189175.2 jmol-1
zpe.correction: 0.452933 hartree
zpe.thermalcorrener: 0.483157 hartree
zpe.thermalcorrenthalpy: 0.484101 hartree
zpe.thermalcorrgfe: 0.389659 hartree
zpe.sumelectzpe: -1656.600074 hartree
zpe.sumelectthermal: -1656.569851 hartree
zpe.sumelectthermalent: -1656.568906 hartree
zpe.sumelectthermalfe: -1656.663348 hartree
dipole: 1.8914 15.6604 -6.1938
dipole: 16.9466
quadrupole: -119.8787 -147.8029 -216.5519
quadrupole: -3.2845 -4.9517 16.3152
quadrupole: 41.5325 13.6082 -55.1407 -3.2845 -4.9517 16.3152
hfenergy: -1657.0530074 hartree
pointgroup: C01 [X(C29H22N4O3Ru1)]
dipole: 2.3746603 -6.173138 0.8405111 debye
polarizability: 626.0870375|-102.9377031|644.028224|-5.9910784|-2.7887134|687.5855304 unknown
InChI: InChI=1S/C11H7N2O2.2C9H7N.H2O.Ru/c14-11(15)10-6-3-5-9(13-10)8-4-1-2-7-12-8;2*1-2-4-9-7-10-6-5-8(9)3-1;;/h1-7H;2*1-7H;1H2;/q-3;2*-1;;+6/p-1
charge 1 multiplicity 2
59 atoms
Ru 0.00242591 -0.22509233 0.11957343
O  1.84798553 3.48141913 0.22869748
C  1.53085286 2.27891378 0.20539403
O  0.2988768 1.84903694 0.16084309
C  2.5662084 1.19167126 0.22954369
C  3.94357385 1.37244416 0.28419952
C  4.76120479 0.23696886 0.30306869
C  4.19241053 -1.03677877 0.26830109
C  2.7986777 -1.1566989 0.21384824
C  2.00751292 -2.39506303 0.17519894
C  2.54292501 -3.68347093 0.18380506
C  1.68508181 -4.78203333 0.14785403
C  0.30674439 -4.56761672 0.10423647
C  -0.17681554 -3.262165 0.09736055
N  0.65028533 -2.19789424 0.13101168
N  2.02857057 -0.04395776 0.19482322
H  4.35559321 2.37423421 0.3115329
H  5.83923586 0.3437637 0.34573423
H  4.81879952 -1.92026829 0.28413343
H  3.61730169 -3.81943798 0.21837311
H  2.08964678 -5.78786913 0.15401176
H  -0.39509994 -5.39259922 0.07560419
H  -1.23575445 -3.03780509 0.06344943
O  -1.94813293 -0.43408557 -0.03183242
H  -2.35258942 -0.56051707 0.84498165
N  -0.16572999 -0.18893557 2.22624634
C  0.51636194 -1.03653987 3.06805194
C  0.36134066 -1.00417537 4.43105031
C  -0.5330694 -0.0768403 5.02612707
C  -0.75890925 0.01126142 6.4238011
C  -1.65199617 0.94098382 6.91845948
C  -2.35091743 1.81769027 6.04781812
C  -2.14946288 1.7581767 4.6850058
C  -1.23757323 0.80837866 4.1500356
C  -1.00316969 0.70271804 2.75928348
H  1.19120977 -1.74090406 2.60131527
H  0.92516334 -1.69449394 5.04964358
H  -0.22410257 -0.65917237 7.08954745
H  -1.82640886 1.00640558 7.98798569
H  -3.04805615 2.53800876 6.46366686
H  -2.67912728 2.42312522 4.00939075
H  -1.51513125 1.36481555 2.06798969
N  0.02652892 -0.16077387 -1.9943659
C  0.84384238 -0.93520191 -2.78256608
C  0.809903 -0.8829928 -4.15355641
C  -0.09458182 -0.00898263 -4.81099392
C  -0.19932888 0.09736024 -6.22189204
C  -1.11202968 0.97037684 -6.77982222
C  -1.95166031 1.77086309 -5.96163811
C  -1.87062653 1.69184649 -4.58744374
C  -0.94126398 0.79929428 -3.9877293
C  -0.82711589 0.67639961 -2.58341326
H  1.52272698 -1.60142978 -2.26734009
H  1.47541142 -1.51682999 -4.73013585
H  0.44229159 -0.51525928 -6.84784251
H  -1.19322291 1.04956567 -7.8595322
H  -2.66102793 2.44781603 -6.42684392
H  -2.50799813 2.29895708 -3.95152064
H  -1.45263098 1.2741207 -1.92912683
