program: Gaussian 09
title: /home/michael/molsimp_comfiles/Ru_3a1_20_OH/Ru_3a1_20_OH.com auto generated
version: ES64L-G09RevE.01
frameworkgroup: C1[X(C28H20N5O3Ru)]
method: UTPSSh
basis: Gen
operation: Freq
keyword: #P
keyword: Geom=AllCheck
keyword: Guess=TCheck
keyword: SCRF=Check
keyword: GenChk
keyword: UTPSSh/ChkBas
keyword: Freq
title: /home/michael/molsimp_comfiles/Ru_3a1_20_OH/Ru_3a1_20_OH.com auto gene
converged: YES YES NO NO
polarizability: 6.71945690e+02 6.08866690e+00 7.29246963e+02 8.90426497e+00 2.06585930e+00 5.29149151e+02
1716.lowfreq: -5.4815 -0.0006 0.0005 0.0008 9.0563 15.4794 17.7167 24.1521 28.2215
frequency: 12.9088 22.1241 26.4699 29.0777 35.5477 45.3053 62.5409 77.3066 110.0618 112.9017 123.9620 135.6123 165.0757 166.3099 175.6008 179.2927 181.1611 200.4242 207.4628 220.8519 229.9483 251.8900 258.3690 274.8504 281.3555 286.6970 304.5268 321.3223 358.6840 385.9497 391.1787 394.8054 395.6396 417.0178 435.1194 452.4130 470.4573 476.6112 477.6159 488.5712 499.1441 507.9257 523.9961 531.6508 543.4148 548.8826 571.8992 574.6061 639.4750 641.3500 645.6767 648.6548 661.1827 665.8012 692.7137 721.1817 761.8667 763.5291 767.2028 767.4025 774.7885 775.5307 786.4154 789.4731 792.7901 797.2101 814.6001 834.8615 839.8318 845.3235 846.2627 856.8126 877.8915 890.0287 893.3649 920.8191 945.1738 952.5487 965.6210 974.7579 976.2101 987.4733 989.2533 995.0879 998.1253 1018.3611 1024.9959 1025.3674 1030.0082 1032.7369 1033.9023 1040.3172 1048.9977 1068.8242 1072.0244 1103.6716 1105.3325 1109.5013 1144.6824 1157.5412 1157.8074 1172.3874 1176.5210 1181.9616 1185.7666 1190.7264 1199.4556 1217.4839 1247.0356 1250.3144 1283.0434 1286.3892 1295.3141 1299.4741 1311.9921 1313.9821 1328.3453 1341.9034 1360.7892 1378.0295 1378.8483 1412.7788 1433.1286 1435.8050 1440.5688 1454.9651 1477.0871 1482.0840 1484.7793 1492.0658 1496.0450 1525.6283 1541.2315 1545.7438 1584.9164 1603.7681 1607.2351 1609.1324 1614.8074 1624.8131 1640.4572 1642.5395 1648.7365 1661.5171 1672.5561 3202.7810 3208.3997 3211.3562 3217.3190 3218.8378 3224.2179 3226.1044 3226.8757 3230.6269 3231.7307 3232.0588 3234.0515 3234.4759 3240.8138 3245.8864 3249.9569 3252.2580 3253.8021 3260.6430 3270.4578
redmass: 4.8547 6.4063 6.0085 4.5828 5.9896 5.8149 7.5498 6.3209 4.4855 5.8764 6.4216 7.1400 5.2856 6.3524 5.4053 3.9753 4.7562 6.7458 10.7315 7.6005 9.4728 7.1369 7.6191 7.0408 7.1334 8.2891 8.8507 12.6709 8.5234 4.3480 3.5302 3.1795 8.0003 5.0107 3.6332 4.1619 4.4089 2.9206 2.9882 3.4763 3.8050 8.1591 6.7792 7.0036 8.0299 7.9572 4.0835 7.2869 7.2396 6.5545 3.5590 7.0961 7.0507 4.4143 8.0124 5.8084 1.8831 1.3161 2.5080 2.1937 1.9906 3.0610 5.5697 4.7239 3.6945 2.1203 15.8292 5.1840 1.4348 2.7179 4.5100 1.3552 7.7922 1.3953 1.5021 1.3190 1.4645 1.3949 5.0078 1.3219 5.1268 1.3288 1.3738 1.3818 1.3599 1.3042 1.3167 1.3397 1.3363 7.4178 2.3168 2.3698 6.8599 3.5296 2.6181 3.2581 2.4855 1.6254 1.7110 1.5152 1.4995 1.2185 1.1095 1.2279 1.3762 1.6930 1.3635 1.6127 2.9416 2.2012 1.6271 1.7748 1.8338 3.2145 5.2011 3.1885 2.0276 3.0667 2.4859 4.1664 4.6433 1.7055 7.1294 2.5415 6.1443 2.0547 2.5634 2.3520 2.3225 2.4941 2.0246 2.9436 3.0859 3.2474 6.6210 5.6389 6.3988 9.7024 7.1600 5.8451 5.7248 5.1563 5.6945 5.6847 6.0457 1.0866 1.0890 1.0873 1.0954 1.0896 1.0914 1.0984 1.0956 1.0900 1.0894 1.0928 1.0925 1.0986 1.0916 1.0952 1.0937 1.0976 1.0979 1.0946 1.0955
irintensity: 3.1996 2.2072 2.8429 0.4855 2.2312 8.0179 2.3571 1.4468 7.7165 1.9408 0.9006 1.2182 1.1720 0.8238 9.2077 1.1315 11.6754 2.2825 20.5746 5.3920 1.2599 4.2034 2.0248 26.0294 3.6105 45.2963 23.1790 45.5629 1.8500 5.8502 2.7745 0.1584 35.2063 9.8556 4.6819 28.5246 0.0210 23.7728 0.3011 17.7256 3.0925 9.6197 0.1395 0.7021 10.3370 2.1038 0.2582 2.7262 10.3194 11.5392 8.5837 10.1064 15.6214 0.1631 28.5215 47.3789 2.0464 25.4783 19.5516 76.3939 93.2005 28.8932 14.7484 0.6595 8.8557 33.4928 244.0295 5.7402 71.3482 12.2461 11.0835 79.0990 36.1817 13.5566 5.8955 0.0262 14.1187 0.0152 2.4956 0.1285 2.1738 0.2666 7.1479 1.8528 4.1497 0.0185 0.0064 0.2701 0.2263 9.9160 5.9124 10.8373 13.4664 7.4254 65.6745 0.7678 3.6060 29.4998 6.5915 10.6149 4.3133 9.7863 5.3006 30.7353 2.2241 46.5777 21.4721 73.5458 19.5588 7.5644 3.8744 2.2507 13.7285 203.7725 40.5128 13.1831 115.9304 10.6771 57.3491 47.0454 104.4947 41.3499 41.0781 8.9426 79.3303 18.2473 8.2709 6.1111 6.2857 227.4377 13.4661 1.8858 28.7224 12.6461 30.5167 57.1739 3.4399 1383.5228 201.7091 35.9931 44.4618 15.1192 7.6419 5.0376 79.2278 0.4098 1.1941 0.0919 27.0441 3.9585 4.3051 30.2737 15.6859 4.0264 3.9182 0.9545 0.9566 18.7914 1.4357 0.1783 0.9998 1.8522 2.9324 15.0000 6.8838
temp: 298.150 k
press: 1.00000 atm
elementType: 44 8 6 8 6 6 6 6 6 6 6 6 6 6 7 7 1 1 1 1 1 1 1 8 7 6 6 6 6 6 6 6 6 7 1 1 1 1 1 1 7 6 6 6 6 6 6 6 6 6 1 1 1 1 1 1 1
symmnumber: 1
zpe: 1129392.7 jmol-1
zpe.correction: 0.430163 hartree
zpe.thermalcorrener: 0.459611 hartree
zpe.thermalcorrenthalpy: 0.460555 hartree
zpe.thermalcorrgfe: 0.366942 hartree
zpe.sumelectzpe: -1671.991543 hartree
zpe.sumelectthermal: -1671.962095 hartree
zpe.sumelectthermalent: -1671.961151 hartree
zpe.sumelectthermalfe: -1672.054764 hartree
dipole: -2.6925 19.5728 0.1615
dipole: 19.7578
quadrupole: -90.7067 -151.5361 -212.1523
quadrupole: -1.5030 -0.0680 17.5332
quadrupole: 60.7583 -0.0711 -60.6873 -1.5030 -0.0680 17.5332
hfenergy: -1672.421706 hartree
pointgroup: C01 [X(C28H20N5O3Ru1)]
dipole: 4.604102 6.1834656 0.9957195 debye
polarizability: 600.0507094|95.8783361|657.9630407|-8.9550561|-1.6268018|672.3280544 unknown
InChI: InChI=1S/C11H7N2O2.C9H7N.C8H6N2.O.Ru/c14-11(15)10-6-3-5-9(13-10)8-4-1-2-7-12-8;1-2-4-9-7-10-6-5-8(9)3-1;1-2-4-8-7(3-1)5-6-9-10-8;;/h1-7H;1-7H;1-6H;;/q-3;2*-1;;+5
charge 1 multiplicity 3
57 atoms
Ru -0.1384982 0.39441712 -0.08667843
O  1.48928369 -3.43913184 -0.28164372
C  1.23734963 -2.22145992 -0.23350658
O  0.03157946 -1.73091192 -0.14873048
C  2.3536448 -1.20318483 -0.27203891
C  3.71461981 -1.47084806 -0.37793223
C  4.59628703 -0.38249212 -0.41081615
C  4.1178711 0.92802513 -0.33922653
C  2.73666587 1.13106157 -0.23230165
C  2.01742242 2.41800335 -0.14670117
C  2.63970333 3.66628056 -0.1391916
C  1.86286601 4.82228148 -0.05609797
C  0.47542317 4.70594197 0.01914833
C  -0.09851483 3.43728013 0.00934108
N  0.64802399 2.3192397 -0.07213963
N  1.91331876 0.06335266 -0.20103234
H  4.06974014 -2.49280526 -0.43404975
H  5.66342809 -0.55560712 -0.4941382
H  4.80348205 1.76610694 -0.36649771
H  3.71972301 3.72928938 -0.19786283
H  2.3380521 5.79677717 -0.05001477
H  -0.16596242 5.57668871 0.08516703
H  -1.16978428 3.28690486 0.06597749
O  -1.8730784 0.83450098 -0.01649313
N  -0.05256152 0.26505513 2.03065583
C  0.76950499 1.01666856 2.81704709
C  0.78037063 0.88295641 4.18864018
C  -0.08475818 -0.05355788 4.78211618
C  -0.180558 -0.29495458 6.1775782
C  -1.0696316 -1.23885087 6.64336037
C  -1.8938796 -1.97699113 5.74762818
C  -1.8261428 -1.76760748 4.38959084
C  -0.91655403 -0.79887709 3.88248191
N  -0.87622939 -0.61994097 2.53529102
H  1.40705907 1.72623544 2.30908478
H  1.44488192 1.49538228 4.78820876
H  0.44962087 0.2705228 6.85617393
H  -1.1481552 -1.4282166 7.70899089
H  -2.5823417 -2.71382583 6.1479689
H  -2.44548464 -2.32091667 3.69185715
N  -0.20565418 0.33687428 -2.21503043
C  0.49092929 1.18487404 -3.04128823
C  0.42144176 1.0940113 -4.40875986
C  -0.39187585 0.10301396 -5.01705379
C  -0.51621364 -0.05712515 -6.42095194
C  -1.33059208 -1.04942928 -6.92947719
C  -2.05125288 -1.91816646 -6.06834761
C  -1.95175381 -1.78676387 -4.69971634
C  -1.11953247 -0.77380232 -4.15038721
C  -0.98095672 -0.60348547 -2.75437892
H  1.09968688 1.93889939 -2.56194009
H  0.98990335 1.78678976 -5.02004073
H  0.03401677 0.60680534 -7.0804268
H  -1.42484758 -1.17194573 -8.00401291
H  -2.68314504 -2.68954285 -6.49650995
H  -2.49676172 -2.44537698 -4.03031988
H  -1.51399624 -1.25094415 -2.06682343
