program: Gaussian 09
title: /home/michael/molsimp_comfiles/Ru_3a1_19_OH/Ru_3a1_19_OH.com auto generated
version: ES64L-G09RevE.01
frameworkgroup: C1[X(C27H19N6O3Ru)]
method: UTPSSh
basis: Gen
operation: Freq
keyword: #P
keyword: Geom=AllCheck
keyword: Guess=TCheck
keyword: SCRF=Check
keyword: GenChk
keyword: UTPSSh/ChkBas
keyword: Freq
title: /home/michael/molsimp_comfiles/Ru_3a1_19_OH/Ru_3a1_19_OH.com auto gene
converged: YES YES YES YES
polarizability: 1.00518556e+03 -5.41565520e+01 7.37256401e+02 -3.00435704e+01 1.26502706e+01 5.98096345e+02
1716.lowfreq: -20.0138 0.0004 0.0007 0.0009 9.4940 13.1627 21.3412 24.4086 24.9990
frequency: -14.1231 21.5241 24.0388 38.4039 47.3153 52.0163 55.8970 80.3615 96.8955 99.8515 105.9762 119.8824 134.7705 159.7727 164.7091 174.3700 177.5747 183.6959 189.4070 201.8435 216.9556 239.3495 244.7526 262.0531 275.6230 282.0852 298.0271 303.1865 362.0375 389.3462 392.6701 397.5578 401.4108 412.5867 429.4743 444.3944 458.8921 473.3990 474.4417 488.9161 491.7004 507.7206 530.3898 530.6861 547.9690 549.4543 570.0504 576.5623 636.2012 639.5427 651.2087 657.5027 660.8895 661.8869 695.0178 720.7271 754.8430 761.7202 763.7719 764.9316 770.7385 772.7358 782.8276 785.5805 789.9888 791.8534 794.7713 844.2153 846.4996 847.7452 854.5044 857.5745 872.5753 895.3736 895.6056 916.0578 956.1317 971.6290 975.0689 991.0856 991.4145 1001.4109 1001.7564 1003.2586 1017.8589 1026.5571 1028.3648 1031.0236 1033.2830 1033.5750 1034.4837 1052.9581 1061.9849 1083.3346 1097.0465 1101.7199 1102.7343 1115.0961 1150.2618 1156.4839 1157.0283 1172.8997 1173.6247 1181.4279 1184.7998 1186.3524 1197.8454 1250.4658 1254.0171 1264.9726 1287.3184 1288.2088 1311.8756 1315.0105 1317.9426 1319.4689 1344.4507 1349.6345 1350.9917 1383.8585 1439.5526 1441.8950 1443.2791 1454.8930 1455.8263 1477.6918 1479.4065 1483.0867 1493.5404 1525.8032 1536.7272 1538.6918 1571.3950 1580.2016 1595.8355 1610.1411 1612.9559 1617.9756 1632.3130 1640.7236 1651.2061 1656.5269 1678.2719 3215.4391 3216.9695 3223.0003 3224.3266 3231.1169 3232.0344 3235.7759 3237.3139 3237.7770 3237.8089 3238.6518 3239.7869 3246.1862 3250.8955 3253.5017 3256.1489 3262.7734 3290.8444 3294.2103
redmass: 5.1464 6.4990 6.3716 6.2728 4.9470 5.3264 7.8565 6.0273 7.2710 5.7601 5.6349 7.6325 8.0540 5.6260 6.9672 6.6951 5.5697 6.1489 4.2593 6.2177 7.8993 7.0421 8.0714 7.6841 8.2740 5.7460 12.6485 9.9774 9.0142 3.6635 3.6067 5.4461 6.3960 4.7979 3.6449 4.0338 4.0148 3.1304 3.1288 3.6323 3.6643 8.2014 7.0031 7.0081 8.0697 8.1700 3.9925 7.3203 7.3671 7.2825 6.9553 4.4592 5.0864 5.8373 7.8699 5.3991 1.9324 8.7681 1.4804 1.4794 7.1691 2.0528 5.8980 5.5950 3.2754 3.1332 2.0702 5.5367 4.5155 2.6077 1.3105 1.3825 7.6196 1.5025 1.4807 1.3855 1.4089 5.4224 5.2307 1.3212 1.3226 1.3770 1.3627 1.3610 7.4714 1.3302 1.3410 1.3770 2.3067 2.3036 1.3536 6.3125 5.4430 2.9971 3.5465 2.7297 2.8495 1.8924 1.7248 1.5272 1.5339 1.2313 1.2643 1.1006 1.2943 1.3110 1.2316 3.0329 3.0822 2.6657 1.7527 1.7901 2.5006 2.6759 1.8676 5.6745 3.2307 2.6021 3.2907 4.7188 2.5301 6.2082 6.4971 2.0135 1.9855 2.2202 2.2433 2.3486 2.7079 3.3521 3.0379 3.0547 5.8911 6.3531 4.9293 6.9255 5.7400 5.8002 5.7608 6.0668 5.4896 5.5385 12.9070 1.0876 1.0878 1.0898 1.0898 1.0959 1.0958 1.0904 1.0905 1.0936 1.0984 1.0986 1.0933 1.0948 1.0935 1.0955 1.0965 1.0983 1.0945 1.0938
irintensity: 3.5298 3.5731 1.0946 3.9955 2.4783 3.5015 7.8785 3.0678 0.2191 4.6705 0.9962 10.5751 5.8752 0.6021 22.6037 37.4880 9.8492 1.9245 8.3761 1.5782 26.1224 82.6775 71.4267 84.5994 12.4468 16.3974 111.8548 70.8467 2.0448 1.3520 1.0109 26.9214 62.4590 0.0707 13.2920 30.4616 6.4377 13.4547 16.1705 2.1863 2.1192 42.7723 11.6810 4.0674 27.5908 19.1699 0.2298 8.7722 12.2481 9.5003 21.9128 8.4175 17.3601 4.3296 44.8401 67.4579 5.1070 49.6285 45.5331 85.1446 12.7520 86.0533 56.7774 31.1386 9.0208 19.1062 44.3468 38.5507 73.3466 3.5363 88.6848 46.1488 128.7594 12.2524 11.2507 0.7064 0.0401 10.3146 3.2006 0.9691 0.9115 1.7754 3.4359 4.1285 113.1408 0.2828 0.2911 0.3939 4.6107 3.6102 0.5440 87.6161 314.9738 346.1749 100.6371 101.9838 107.0684 62.3574 77.3017 11.9766 16.5322 7.1161 34.2781 4.1301 12.6706 62.0392 39.2171 59.9936 8.2909 215.2899 4.1206 4.1508 8.7466 11.5006 68.9790 54.5036 24.0180 91.6103 40.6349 115.3185 17.3286 291.6494 266.3105 48.7217 102.9802 47.4702 55.9622 31.1921 280.5869 64.3347 19.9911 6.9553 26.4283 14.9031 8.9598 14.7707 52.5359 57.7178 35.5994 201.4026 285.8808 52.5680 1282.9913 0.5266 0.6367 3.3303 2.8843 14.4318 16.3906 2.2912 2.1314 0.1352 23.8803 41.1851 1.1947 2.1780 0.2897 3.1058 1.4101 8.2423 17.0611 14.5279
temp: 298.150 k
press: 1.00000 atm
elementType: 44 8 6 8 6 6 6 6 6 6 6 6 6 6 7 7 1 1 1 1 1 1 1 8 7 6 6 6 6 6 6 6 6 7 1 1 1 1 1 1 7 6 6 6 6 6 6 6 6 7 1 1 1 1 1 1
symmnumber: 1
zpe: 1094105.2 jmol-1
zpe.correction: 0.416723 hartree
zpe.thermalcorrener: 0.445591 hartree
zpe.thermalcorrenthalpy: 0.446535 hartree
zpe.thermalcorrgfe: 0.355414 hartree
zpe.sumelectzpe: -1687.787780 hartree
zpe.sumelectthermal: -1687.758912 hartree
zpe.sumelectthermalent: -1687.757968 hartree
zpe.sumelectthermalfe: -1687.849089 hartree
dipole: 1.8504 19.6839 -5.0150
dipole: 20.3968
quadrupole: -37.9191 -129.5079 -187.2560
quadrupole: -4.0689 7.7966 9.8234
quadrupole: 80.3086 -11.2802 -69.0283 -4.0689 7.7966 9.8234
hfenergy: -1688.2045028 hartree
pointgroup: C01 [X(C27H19N6O3Ru1)]
dipole: 0.709825 7.7505652 -1.954747 debye
polarizability: 1006.8839365|-52.4890853|736.4993137|-22.7559258|11.5945555|597.1550528 unknown
InChI: InChI=1S/C11H7N2O2.2C8H6N2.O.Ru/c14-11(15)10-6-3-5-9(13-10)8-4-1-2-7-12-8;2*1-2-4-8-7(3-1)5-6-9-10-8;;/h1-7H;2*1-6H;;/q-3;2*-1;;+5
charge 2 multiplicity 4
56 atoms
Ru 0.01935211 -0.23605904 -0.21910197
O  -0.35307646 -1.17996944 3.72557713
C  -0.25415944 -0.6153199 2.64138774
O  -0.1152922 -1.29990583 1.49585434
C  -0.27541725 0.87766106 2.48193774
C  -0.39545734 1.82818269 3.49016139
C  -0.37500307 3.17858164 3.11609841
C  -0.22795761 3.55252131 1.77702703
C  -0.10597277 2.54679772 0.8110609
C  0.08877031 2.69570946 -0.6428204
C  0.20444305 3.91213497 -1.3066771
C  0.38471722 3.92324613 -2.6926874
C  0.44043446 2.71763131 -3.39286182
C  0.32127256 1.52422781 -2.68980284
N  0.15576758 1.51322506 -1.34998976
N  -0.14665032 1.25742001 1.2015382
H  -0.49950815 1.52309024 4.52432685
H  -0.46918728 3.94749259 3.87452331
H  -0.20471253 4.59794188 1.49494848
H  0.15679381 4.83831145 -0.74746566
H  0.47864167 4.86800908 -3.21596147
H  0.57600862 2.6886555 -4.4670644
H  0.35773436 0.55635488 -3.1734555
O  0.12952411 -1.47421812 -1.52537211
N  -2.11124964 -0.26914854 -0.45020934
C  -2.89030385 0.80278721 -0.7638713
C  -4.25906135 0.67885422 -0.86949432
C  -4.84438909 -0.57849329 -0.6440711
C  -6.23590826 -0.84222814 -0.71330641
C  -6.69560957 -2.11907536 -0.47287349
C  -5.79787029 -3.17942198 -0.15981815
C  -4.44208438 -2.96078021 -0.08766856
C  -3.94210348 -1.65085633 -0.32867878
N  -2.60031762 -1.46575284 -0.25021847
H  -2.38825879 1.74445654 -0.92989824
H  -4.86073176 1.54463468 -1.12278407
H  -6.91598524 -0.03203177 -0.95382232
H  -7.75927776 -2.32772231 -0.52139147
H  -6.19646183 -4.17148612 0.02370359
H  -3.7427875 -3.75473025 0.14988402
N  2.12948938 -0.25919508 -0.03546302
C  2.85870259 0.65766416 0.66156141
C  4.21582717 0.49859871 0.84119663
C  4.84337933 -0.63665499 0.29903913
C  6.2228933 -0.93120934 0.42139833
C  6.72424438 -2.08119332 -0.15435298
C  5.88214971 -2.9770541 -0.87246698
C  4.5388179 -2.72145135 -1.01393775
C  3.99558041 -1.54294377 -0.42623867
N  2.66882724 -1.32632952 -0.57657283
H  2.32352244 1.50448752 1.06527687
H  4.77568417 1.24023595 1.39979913
H  6.86457793 -0.2482766 0.96762759
H  7.77990402 -2.31355041 -0.06057859
H  6.31276387 -3.87159537 -1.30916081
H  3.87801014 -3.39036946 -1.55405912
