program: Gaussian 09
title: /home/michael/molsimp_comfiles/Ru_3a1_17_OH/Ru_3a1_17_OH.com auto generated
version: ES64L-G09RevE.01
frameworkgroup: C1[X(C28H21N4O4Ru)]
method: UTPSSh
basis: Gen
operation: Freq
keyword: #PGeom=AllCheck
keyword: Guess=TCheck
keyword: SCRF=Check
keyword: GenChk
keyword: UTPSSh/ChkBas
keyword: Freq
title: /home/michael/molsimp_comfiles/Ru_3a1_17_OH/Ru_3a1_17_OH.com auto gene
converged: YES YES NO NO
polarizability: 6.55017557e+02 1.06682811e+02 7.35142536e+02 -1.53271422e+01 -1.12879092e+01 5.87760731e+02
1716.lowfreq: -7.4944 -0.0005 0.0001 0.0005 7.7467 15.3003 19.0514 21.2510 29.7405
frequency: 12.8073 19.1335 29.2961 35.1629 41.7462 46.5082 50.6479 64.1457 92.2965 110.4589 125.8704 138.3250 145.0413 151.4107 166.6759 179.0190 181.1707 184.0314 188.4058 199.0408 216.1048 222.8451 244.0617 259.2253 262.2665 277.6198 290.9059 299.2197 310.1035 326.3124 348.5864 360.3486 392.0799 396.1585 396.6284 407.6568 453.1968 461.1770 468.8171 478.7773 487.5343 498.8754 515.1737 517.8594 524.6622 533.2348 539.9111 541.3571 578.4918 586.8769 606.8229 623.5979 640.0929 643.2463 649.8545 651.9575 657.0041 692.5085 694.7746 701.3508 735.4575 742.6181 758.5013 764.3649 767.9854 771.6899 776.6642 788.8477 803.6676 816.8993 832.1056 844.6052 857.9365 864.1850 880.3130 884.9463 888.9801 891.5151 922.9734 937.5576 948.8305 958.3512 963.5742 975.3666 982.8995 987.8575 989.9069 991.9613 993.9955 1015.7078 1023.4382 1031.3813 1032.6821 1040.5639 1050.0957 1062.7008 1065.3524 1077.4752 1089.2080 1102.4548 1104.5215 1157.2381 1158.8722 1170.9289 1172.2562 1175.6327 1182.4847 1197.6899 1224.6734 1232.1394 1247.7420 1251.9403 1275.2371 1282.3600 1293.0103 1297.3172 1304.8004 1322.8985 1339.8181 1360.6443 1376.1007 1376.7321 1384.1658 1412.2099 1426.6309 1430.6046 1432.4456 1462.3758 1474.3200 1475.2359 1483.2164 1494.9301 1505.3598 1519.1820 1521.1314 1536.5766 1543.9470 1558.0003 1589.0125 1607.1547 1618.0709 1635.4341 1642.0218 1647.7015 1653.3529 1663.8643 1673.2210 3193.8550 3199.9676 3203.1024 3204.8475 3210.0020 3212.6888 3214.3862 3217.3546 3217.6907 3224.1608 3224.8546 3226.1466 3226.7452 3228.7169 3233.8767 3234.0225 3241.9257 3247.7498 3255.4460 3633.9367 3734.3295
redmass: 5.9542 6.3402 5.8275 4.3624 4.5196 5.0876 7.7653 5.0363 5.4489 6.6691 6.2986 5.0228 5.9765 6.3362 6.7083 5.4638 6.1535 4.3917 5.1459 7.0716 6.0995 4.1984 6.9809 6.1081 2.9866 2.3284 7.0995 8.4871 6.0016 7.9690 8.1122 6.5073 4.5324 3.2172 2.7233 10.9233 3.5967 3.9657 10.4261 2.6687 3.9158 3.9923 5.2056 1.5735 6.3325 3.1487 7.4907 7.7440 3.7650 6.4014 8.2049 7.5270 6.7383 6.7237 3.4520 6.3157 5.7541 6.5285 4.2877 1.7669 6.1429 4.4445 1.7842 1.2901 1.5697 1.9476 3.2294 4.7340 10.1303 2.5991 6.0338 1.3796 1.4614 6.3789 1.1689 1.2083 1.3860 6.1861 1.3951 1.4744 1.3256 1.3242 5.1391 1.3143 1.2850 1.3715 1.2793 8.0016 1.4151 1.2945 1.3066 6.5632 5.6826 2.3959 6.5772 2.2565 2.6413 1.8736 1.7160 1.7343 3.0877 1.5024 1.4138 1.0780 1.2989 1.1149 1.3026 1.3695 2.5670 1.2201 2.1478 1.6722 2.9153 1.6303 1.8343 3.8126 1.9055 8.1878 4.8379 5.3015 3.8995 5.3658 1.2391 1.7285 4.0945 7.2195 3.9888 4.6206 2.5415 2.7452 2.2812 2.0362 2.6470 1.9408 3.7671 9.4453 3.2006 4.1250 5.7100 6.3539 5.3581 7.8547 5.1660 5.6605 5.2262 6.5453 6.0631 1.0861 1.0864 1.0877 1.0889 1.0946 1.0875 1.0951 1.0880 1.0911 1.0983 1.0975 1.0917 1.0920 1.0895 1.0969 1.0943 1.0963 1.0977 1.0943 1.0819 1.0668
irintensity: 1.3603 5.6144 5.0461 0.2466 2.9977 4.3279 8.9982 0.9231 0.7200 4.4289 1.7879 2.9192 4.6872 6.1980 0.6362 1.5566 5.0431 0.6062 8.8900 18.1084 5.8319 20.0741 4.5026 46.8069 74.9464 67.7373 1.5492 1.5627 12.5588 23.5346 94.9648 6.9797 8.6696 1.8727 0.1211 2.1462 9.9614 5.9222 3.4869 25.0856 0.8918 9.3298 148.0388 164.8329 8.7164 18.1219 199.2761 4.2941 3.2863 15.8109 31.3440 1.6859 4.5565 4.0006 11.1381 1.2468 5.0493 5.2431 12.1360 86.7541 18.7676 1.0957 170.6769 46.1472 31.8356 24.0370 1.7688 0.0780 109.0449 8.2589 2.8526 84.7061 7.7838 50.2030 100.6365 42.2606 10.7752 37.5879 0.5008 11.0082 4.1901 1.3246 0.4104 0.2957 1.3810 6.8034 0.4367 5.4337 0.3103 0.0135 0.0357 2.8651 9.2899 9.2122 0.1934 16.3612 10.1471 30.7279 11.4123 2.1055 18.6664 2.9568 54.8059 2.3255 2.2121 3.7488 10.9716 4.4230 78.5140 8.6549 10.0051 8.6427 103.8072 4.5308 11.2219 448.7476 23.1695 2.6951 35.9868 644.1073 69.3285 240.7199 6.3977 33.0913 2.8493 20.5107 191.5355 101.9093 27.8461 142.8818 51.4708 2.4779 608.0187 47.5256 583.3759 1305.6167 21.8923 371.3849 59.5544 5.9172 2.3468 120.9477 4.9016 120.8719 6.3634 45.5270 24.4853 6.2079 0.9218 5.0187 0.6946 43.4143 5.1925 31.5304 2.0322 4.8402 36.7369 38.8868 7.3856 1.0382 2.0834 19.0078 1.6418 7.5866 14.9689 12.7115 280.8255 54.0143
temp: 298.150 k
press: 1.00000 atm
elementType: 44 8 6 8 6 6 6 6 6 7 6 6 6 6 6 6 6 8 7 6 1 1 1 1 1 1 1 1 8 1 7 6 6 6 6 6 6 6 6 6 1 1 1 1 1 1 1 7 6 6 6 6 6 1 1 1 1 1
symmnumber: 1
zpe: 1150299.7 jmol-1
zpe.correction: 0.438126 hartree
zpe.thermalcorrener: 0.468968 hartree
zpe.thermalcorrenthalpy: 0.469912 hartree
zpe.thermalcorrgfe: 0.374079 hartree
zpe.sumelectzpe: -1693.285131 hartree
zpe.sumelectthermal: -1693.254290 hartree
zpe.sumelectthermalent: -1693.253345 hartree
zpe.sumelectthermalfe: -1693.349179 hartree
dipole: 6.8345 8.9672 -8.7962
dipole: 14.3001
quadrupole: -147.5564 -232.2487 -195.9217
quadrupole: -17.3803 1.5750 -24.2988
quadrupole: 44.3525 -40.3397 -4.0128 -17.3803 1.5750 -24.2988
hfenergy: -1693.7232572 hartree
pointgroup: C01 [X(C28H21N4O4Ru1)]
dipole: 4.5930576 -3.0452536 -1.1328168 debye
polarizability: 616.236834|-70.5511142|763.0812849|-28.7890331|56.8054917|598.6027041 unknown
InChI: InChI=1S/C14H8N2O3.C9H7N.C5H5N.H2O.Ru/c17-11-7-2-1-4-8(11)13-15-10-6-3-5-9(14(18)19)12(10)16-13;1-2-4-9-7-10-6-5-8(9)3-1;1-2-4-6-5-3-1;;/h1-7,15H;1-7H;1-5H;1H2;/q-3;2*-1;;+6/p-1
charge 0 multiplicity 2
58 atoms
Ru -0.38823924 -0.31021464 -0.38495224
O  0.07985305 3.89341602 -0.22522966
C  0.43231753 2.69067791 -0.33884262
O  -0.45522393 1.73972309 -0.32345727
C  1.87208968 2.34768774 -0.50270178
C  2.84308574 3.35980212 -0.5600563
C  4.20769363 3.07585475 -0.72447491
C  4.67570339 1.76348691 -0.84075393
C  3.7174797 0.75387686 -0.78317864
N  3.81124325 -0.62357421 -0.8585963
C  2.55681066 -1.16238024 -0.74371275
C  2.2658076 -2.58041033 -0.77050545
C  3.32130854 -3.51190981 -0.94166911
C  3.09543472 -4.87734684 -0.97109536
C  1.77993731 -5.35734184 -0.82585955
C  0.72597874 -4.47590189 -0.65564932
C  0.9277458 -3.07107191 -0.62313448
O  -0.15176215 -2.31980742 -0.4556359
N  1.65841918 -0.17344375 -0.59799494
C  2.34216267 1.02617578 -0.61767374
H  2.51821719 4.39106641 -0.47675665
H  4.91707362 3.89588659 -0.76424065
H  5.72939984 1.5414124 -0.96901704
H  4.67163064 -1.14475809 -0.97268777
H  4.33916353 -3.15192915 -1.05406616
H  3.92406611 -5.56433456 -1.10491372
H  1.58444106 -6.42565246 -0.84682192
H  -0.2921481 -4.83623961 -0.54263359
O  -2.3504592 -0.4758858 -0.10997201
H  -2.80188069 -0.53779917 -0.96957922
N  -0.19392248 -0.31049118 1.70627162
C  0.68855012 -1.13379538 2.36535249
C  0.84993213 -1.1027338 3.72824687
C  0.08983484 -0.19721155 4.51495919
C  0.20216571 -0.09336416 5.92585857
C  -0.57297637 0.81967406 6.61320302
C  -1.48852326 1.66140127 5.92892178
C  -1.62102169 1.5823467 4.55853117
C  -0.83352047 0.65235625 3.82701087
C  -0.92705632 0.54324779 2.41938195
H  1.25680761 -1.81408846 1.74448752
H  1.56212434 -1.77194582 4.19986074
H  0.90231231 -0.73695557 6.44995907
H  -0.48455029 0.89906118 7.69241711
H  -2.08522025 2.37061798 6.49376099
H  -2.3172116 2.22202507 4.02408285
H  -1.61116373 1.17653515 1.86516955
N  -0.65478356 -0.22748508 -2.47228139
C  -1.52983361 0.67359752 -2.97769196
C  -1.76786391 0.79636064 -4.34292836
C  -1.08185092 -0.03557847 -5.22939035
C  -0.1776663 -0.96403956 -4.70975601
C  0.00914859 -1.03276044 -3.33278748
H  -2.03214503 1.30521945 -2.25410634
H  -2.47915947 1.53540042 -4.69389785
H  -1.24633476 0.03887439 -6.29920131
H  0.38172613 -1.63188227 -5.35514441
H  0.70364038 -1.739164 -2.8953579
