program: Gaussian 09
title: /home/michael/molsimp_comfiles/Ru_32a_33_OH/Ru_32a_33_OH.com auto generated
version: ES64L-G09RevE.01
frameworkgroup: C1[X(C22H15N6O4Ru)]
method: UTPSSh
basis: Gen
operation: Freq
keyword: #P
keyword: Geom=AllCheck
keyword: Guess=TCheck
keyword: SCRF=Check
keyword: GenChk
keyword: UTPSSh/ChkBas
keyword: Freq
title: /home/michael/molsimp_comfiles/Ru_32a_33_OH/Ru_32a_33_OH.com auto gene
converged: YES YES NO YES
polarizability: 6.75493411e+02 5.04081046e+00 6.59950672e+02 -3.96936347e+01 -4.19975937e+00 4.23857339e+02
1716.lowfreq: -17.6894 -0.0002 0.0005 0.0008 14.0147 15.9454 25.7156 26.6856 35.3645
frequency: 24.7030 26.3961 35.1674 49.4974 63.4633 75.3294 93.1744 113.7937 126.9056 134.6087 137.8097 167.3279 171.5346 187.9071 195.1216 212.4981 224.2543 237.3200 254.3467 265.4078 268.6618 283.8616 298.5476 303.3543 315.8247 336.4574 343.9463 354.0992 370.3894 405.5824 415.1519 441.6086 449.3266 455.7950 483.8805 490.1537 490.6361 503.7429 512.5871 537.5237 547.1441 551.7803 578.1656 588.8254 610.8128 636.0034 641.5710 657.9120 663.9883 687.6048 693.0726 699.8542 741.5700 749.7768 761.2403 762.1545 773.4798 796.4807 808.2445 821.2839 827.0818 831.8453 846.4911 857.7221 868.9576 889.8790 894.2207 927.3691 957.3397 985.7439 993.7916 999.2836 1002.1695 1004.7649 1018.0767 1022.0741 1026.2887 1029.1829 1032.4415 1065.3750 1071.3405 1074.2370 1098.3568 1106.9180 1126.4204 1137.1703 1154.7061 1157.4666 1168.7939 1180.4509 1213.7098 1245.6119 1253.8267 1254.9417 1272.8502 1295.9907 1302.8159 1308.1994 1326.6125 1330.3679 1342.9417 1365.4724 1368.1155 1425.9181 1432.5671 1438.7104 1445.7126 1464.3126 1475.0683 1483.3294 1497.3111 1504.7371 1525.8664 1542.1535 1561.7468 1594.4354 1595.0474 1603.8189 1619.2761 1631.4962 1639.2826 1645.8285 1661.1293 3198.0638 3205.0558 3212.6102 3213.2049 3226.4537 3227.0073 3228.0352 3228.4051 3234.1756 3237.5484 3244.8767 3255.0426 3260.4203 3628.2259 3733.9622
redmass: 6.8302 6.0239 6.9268 7.9929 5.1178 5.0500 6.9220 4.5655 4.9464 6.2905 6.2019 6.8153 6.3817 5.6193 6.5977 4.6103 6.0229 5.8615 6.0500 6.6507 7.6511 6.5893 6.3759 2.1103 6.0187 7.3448 6.5946 6.0762 7.8324 10.2666 3.4621 5.4586 5.3603 3.3585 2.9032 7.8734 6.0627 1.9037 9.0834 3.5213 5.0907 2.6800 3.8166 6.4840 7.8723 7.8637 8.0139 5.7494 7.9083 7.9734 5.3459 5.7978 7.0386 4.6730 3.4291 1.8556 1.4259 6.6123 10.0120 2.7459 1.7770 1.4435 3.1833 6.3839 1.4769 1.1245 6.3964 1.3975 1.3394 1.2883 1.2746 8.3660 1.3701 1.3724 1.4010 1.4224 5.9032 8.9478 8.8718 2.1938 1.8467 4.0594 2.3477 3.0796 1.5335 1.4711 1.9987 1.5340 1.3163 1.2415 2.4548 2.8523 1.7523 1.8056 3.4274 2.1409 2.6502 9.6645 2.1852 5.8730 5.3359 2.2573 6.0195 5.0882 2.9794 2.3548 1.9620 4.3775 2.7019 2.3052 4.3038 2.7202 3.9104 9.8725 4.7772 4.5888 5.6657 4.7590 6.0089 6.7216 7.4715 5.9957 6.7229 1.0861 1.0887 1.0877 1.0944 1.0917 1.0978 1.0915 1.0920 1.0968 1.0935 1.0922 1.0989 1.0991 1.0823 1.0664
irintensity: 0.4413 0.4389 10.5885 3.6388 12.6907 16.2894 3.3596 0.0783 2.6763 12.8306 1.4326 6.9524 2.9598 3.4999 0.6690 8.3251 2.2938 3.0580 3.7673 1.3220 4.9644 8.0173 8.1477 166.3182 21.1360 9.2799 197.5885 3.0825 4.1146 0.2653 0.0731 1.8918 5.2484 28.0259 7.4701 88.0359 17.7364 202.9583 142.6252 3.1442 54.9411 0.2005 3.9771 7.9226 30.2144 29.1592 9.6114 5.6267 12.2669 14.6376 2.3186 5.2281 3.3927 4.3754 119.5753 150.1609 59.8235 5.3419 131.5967 5.1603 1.9894 41.0273 0.2315 65.1678 6.0129 127.0861 26.1455 0.4392 5.4012 1.1651 0.2353 11.0311 0.0988 0.1944 0.7195 0.1427 13.7483 2.1535 32.2674 15.9065 32.7037 0.2825 3.5804 32.3638 3.6716 3.5341 2.4793 42.5051 10.7360 4.8971 190.1205 186.8045 2.4267 51.4344 2.5146 223.3076 222.9495 12.8639 0.2984 45.1715 598.3975 1.2982 154.4951 97.4678 48.5237 246.2429 57.2911 77.3565 126.5775 29.5032 10.6771 344.4306 367.1611 1352.6038 206.4108 51.7732 50.1996 51.2100 136.3685 15.9462 110.0626 31.0194 27.0691 6.3371 5.6214 4.6325 35.9959 5.4172 43.3389 16.8356 9.4598 17.2676 1.7874 3.4832 3.3400 2.1070 301.1624 44.0690
temp: 298.150 k
press: 1.00000 atm
elementType: 44 8 6 8 6 6 6 6 6 7 6 6 6 6 6 6 6 8 7 6 1 1 1 1 1 1 1 1 6 6 7 6 6 7 6 6 6 7 7 6 1 1 1 1 1 1 8 1
symmnumber: 1
zpe: 909083.6 jmol-1
zpe.correction: 0.346252 hartree
zpe.thermalcorrener: 0.372639 hartree
zpe.thermalcorrenthalpy: 0.373583 hartree
zpe.thermalcorrgfe: 0.289176 hartree
zpe.sumelectzpe: -1570.606006 hartree
zpe.sumelectthermal: -1570.579618 hartree
zpe.sumelectthermalent: -1570.578674 hartree
zpe.sumelectthermalfe: -1570.663081 hartree
dipole: -7.4973 8.7114 9.4241
dipole: 14.8631
quadrupole: -128.2080 -223.3023 -182.3912
quadrupole: 3.2543 -21.4237 -20.2660
quadrupole: 49.7592 -45.3351 -4.4240 3.2543 -21.4237 -20.2660
hfenergy: -1570.9522573 hartree
pointgroup: C01 [X(C22H15N6O4Ru1)]
dipole: 3.1045719 -4.383505 2.31106 debye
polarizability: 680.8926953|-0.5924704|639.3397032|18.0811657|66.7542551|439.0690233 unknown
InChI: InChI=1S/C14H8N2O3.C8H6N4.H2O.Ru/c17-11-7-2-1-4-8(11)13-15-10-6-3-5-9(14(18)19)12(10)16-13;1-3-9-7(10-4-1)8-11-5-2-6-12-8;;/h1-7,15H;1-6H;1H2;/q-3;-2;;+6/p-1
charge 0 multiplicity 2
48 atoms
Ru 0.02058489 -0.14368807 0.38206099
O  0.85531541 3.98640263 0.94128008
C  1.06914843 2.75395835 0.82691768
O  0.08223079 1.93765963 0.57762632
C  2.46707502 2.24191064 0.97749355
C  3.52119419 3.12125199 1.26439198
C  4.8500282 2.67926404 1.38942764
C  5.20078205 1.33654784 1.22562433
C  4.1593322 0.45484182 0.93807935
N  4.12110887 -0.9116785 0.71670841
C  2.82399448 -1.28482843 0.48259065
C  2.37050486 -2.63450283 0.21294195
C  3.32390335 -3.65048946 -0.03350148
C  2.9495287 -4.96465993 -0.27045963
C  1.58597453 -5.30113587 -0.26043106
C  0.62765392 -4.32665194 -0.02261001
C  0.98084086 -2.97646852 0.21005402
O  -0.04187934 -2.13990495 0.43586526
N  2.03314195 -0.20563628 0.55051218
C  2.82227811 0.88993455 0.82398309
H  3.2960786 4.17449025 1.3913589
H  5.62560787 3.40324281 1.61664958
H  6.22705387 0.99868847 1.31827382
H  4.91929073 -1.53418043 0.75451842
H  4.37905482 -3.39604525 -0.05466314
H  3.70502512 -5.71851653 -0.46421896
H  1.27439126 -6.32505475 -0.44427467
H  -0.4296051 -4.57392737 -0.01489038
C  -4.19349073 -0.09871596 -0.74035355
C  -2.8076447 -0.10645611 -0.80925295
N  -2.06139654 -0.11681625 0.31416084
C  -2.71157724 -0.12197975 1.50495034
C  -1.83083192 -0.1345681 2.69251386
N  -0.49968741 -0.14392951 2.4238435
C  0.35313792 -0.14563801 3.46764009
C  -0.11993562 -0.14481584 4.77248938
C  -1.50349098 -0.14244439 4.94804465
N  -2.36262208 -0.13573838 3.91586038
N  -4.03735142 -0.11574352 1.65446468
C  -4.7708767 -0.1031471 0.53007329
H  -4.79741353 -0.08821984 -1.63923372
H  -2.26241929 -0.10131092 -1.74606765
H  1.41026599 -0.15360421 3.23020698
H  0.56066272 -0.14864924 5.61463244
H  -1.94350255 -0.1457765 5.93970159
H  -5.84815984 -0.09666037 0.65725113
O  0.22623373 -0.05765689 -1.5965124
H  1.16368055 0.08918999 -1.81299973
