program: Gaussian 09
title: 000031975
version: EM64L-G09RevD.01
frameworkgroup: C1[X(C8H5Cl3INO)]
method: RPBEPBE
basis: SDD
operation: Freq
keyword: #p
keyword: freq=noraman
keyword: PBEPBE/SDD
title: #p freq=noraman PBEPBE/SDD
converged: YES YES NO NO
title: Mulliken charges:
elementType: I Cl Cl Cl O N C C C C C C C C H H H H H
charge: 0.146256 0.007801 0.008049 -0.051258 -0.242222 -0.439650 0.710537 -0.655055 -0.266435 -0.131172 -0.090280 -0.126286 0.263724 -0.675572 0.341995 0.316316 0.278559 0.302326 0.302367
chargesum: 0.00000
title: Mulliken charges with hydrogens summed into heavy atoms:
elementType: I Cl Cl Cl O N C C C C C C C C
charge: 0.146256 0.007801 0.008049 -0.051258 -0.242222 -0.123334 0.710537 -0.655055 0.075560 0.147387 -0.090280 -0.126286 0.263724 -0.070880
polarizability: 2.30675117e+02 -1.02896752e+01 1.79494186e+02 -1.89875174e-03 4.48724587e-02 5.30885140e+01
1716.lowfreq: -5.4925 -3.9274 -0.0018 0.0005 0.0015 4.7708 27.2857 47.7419 69.0371
frequency: 27.2183 47.7409 69.0371 76.8676 83.8181 128.3051 143.4595 157.8294 177.4380 219.4087 230.7018 264.4412 354.7308 360.0783 396.5304 449.3649 457.8624 482.4863 554.9764 558.2570 618.8574 662.9786 695.7424 704.4484 728.6944 768.1735 861.0027 901.3305 906.2862 925.0261 947.1490 1010.1970 1124.9335 1155.0971 1208.3388 1241.1172 1249.1679 1261.8366 1355.1951 1363.3103 1418.4169 1434.5630 1505.5025 1561.9366 1582.7313 1604.9666 3070.3285 3151.3889 3177.2139 3182.1277 3385.5143
redmass: 16.4134 11.6862 22.6677 3.5430 7.0621 21.4591 19.8795 6.0768 31.5159 23.9144 5.7738 14.4606 13.0206 8.1295 12.5885 3.2454 10.2130 6.5088 3.5044 6.9873 6.9973 7.4610 6.4461 2.7689 8.2481 1.3134 1.4312 7.4623 1.7371 1.4045 6.6007 6.3488 1.8831 1.1111 4.1345 2.2969 1.4174 1.1882 5.5560 9.3641 1.1015 2.7528 3.2789 3.8848 7.6175 6.1241 1.0565 1.1091 1.0926 1.0931 1.0769
irintensity: 0.0514 0.0068 0.0782 17.2433 0.0160 0.8201 2.8309 0.2330 0.0563 1.3954 0.0020 0.9119 15.3398 0.1547 21.5428 22.2031 14.0108 4.9816 0.3951 18.1445 0.2273 9.3176 92.6141 2.5153 15.9525 57.3390 9.9504 14.8948 13.6535 40.4081 9.1984 75.5352 29.9938 0.3883 37.8099 13.5054 5.7250 17.8551 113.2130 17.2200 29.2864 76.2533 543.3150 193.4322 79.3798 124.4400 2.4491 0.2922 29.3410 1.1932 93.5269
temp: 298.150 k
press: 1.00000 atm
elementType: 53 17 17 17 8 7 6 6 6 6 6 6 6 6 1 1 1 1 1
symmnumber: 1
zpe: 299091.1 jmol-1
zpe.correction: 0.113918 hartree
zpe.thermalcorrener: 0.128177 hartree
zpe.thermalcorrenthalpy: 0.129121 hartree
zpe.thermalcorrgfe: 0.068837 hartree
zpe.sumelectzpe: -1828.513457 hartree
zpe.sumelectthermal: -1828.499198 hartree
zpe.sumelectthermalent: -1828.498254 hartree
zpe.sumelectthermalfe: -1828.558539 hartree
dipole: 2.6733 -1.2490 0.0125
dipole: 2.9507
quadrupole: -120.7342 -116.3048 -117.3167
quadrupole: 6.6773 0.0448 0.0281
quadrupole: -2.6157 1.8138 0.8019 6.6773 0.0448 0.0281
hfenergy: -1828.6273753 hartree
pointgroup: C01 [X(C8H5Cl3I1N1O1)]
dipole: -0.7665559 0.8661284 -0.0995198 debye
dipolederiv: -0.0887856 0.1354946 -0.0146563 0.1487321 -0.3515386 0.0636592 -0.0170668 0.0645469 0.0455608 -0.209361 0.2578669 -0.0338544 0.3402903 -0.6199381 0.0845623 -0.0489329 0.0905007 -0.0365233 -0.8598685 0.0568067 0.0473683 -0.0053993 -0.0640303 0.0086851 0.0582868 0.0044017 -0.0229374 -0.420902 0.0939429 0.0019952 0.3257876 -0.4630628 0.0371773 -0.0416379 0.0534883 -0.1499584 -0.7302928 0.2007752 -0.0098119 -0.5076229 -0.9769665 0.1507262 0.1211214 0.1015793 -0.3687198 -1.7209294 -0.3866068 0.1717084 -0.5767036 -0.6877812 0.1174717 0.2076256 0.1047741 -0.2964639 1.0987636 0.4012501 -0.1386838 -0.0698297 -0.1925659 0.066145 -0.0531874 0.0333434 0.1413398 -0.0285123 -0.441141 0.0657838 -0.445663 0.8137224 -0.1598162 0.0664646 -0.1604506 -0.2121174 -0.3278041 -0.0391806 0.0229723 0.175367 -0.2623828 0.0175875 -0.0160562 0.0323693 -0.1026533 -0.2511038 -0.0019943 0.0173468 0.2700513 -0.2277756 0.0224712 -0.0320481 0.0413479 -0.0066976 0.1410219 -0.4153456 0.0627004 -0.4895948 0.9815301 -0.1508902 0.0759112 -0.1563633 -0.0151577 1.0980723 0.0835018 -0.0946705 0.0013933 -0.1771752 0.0195257 -0.0792885 0.0140699 -0.0653411 1.4861927 0.0833521 -0.105099 1.1841119 1.1936603 -0.2623104 -0.3095719 -0.186258 0.2558963 0.0148378 -0.0905936 0.0262197 -0.4283781 0.6193827 -0.0607607 0.0903488 -0.0843994 0.1473614 0.2175815 0.0002308 -0.0021768 0.034897 0.0965974 0.0140483 -0.0083874 0.0164282 0.1848433 0.3945495 0.0287195 -0.0134453 0.0274517 0.2918961 -0.0053686 -0.0129549 -0.0054302 0.2735489 0.073668 -0.0263197 0.0108328 -0.0369475 0.0345923 0.0255552 0.0127121 0.0247946 0.1560551 0.0635886 0.0379045 0.024058 0.0428045 0.0107881 0.0514191 0.0618624 0.0347254 0.0135026 0.0492837 0.0213365 -0.0385876 0.009252 -0.0189524 -0.039888 -0.075201 -0.0234681 0.0584616 unknown
polarizability: 214.2720116|-27.2192728|191.2348056|-6.1817792|-23.2668358|57.7509995 unknown
InChI: InChI=1S/C8H5Cl3INO/c9-3-8(14)13-7-2-5(11)4(10)1-6(7)12/h1-2,13H,3H2
charge 0 multiplicity 1
19 atoms
I  -0.237648 3.375028 -0.488977
Cl 2.735055 -2.641386 0.39716
Cl 4.521115 0.062656 -0.214645
Cl -4.310333 1.58314 0.112593
O  -2.162685 -1.842692 0.593317
N  -1.52853 0.387622 0.141851
C  -0.118123 0.283991 0.063501
C  0.670214 1.443724 -0.201207
C  0.550369 -0.958144 0.242816
C  2.073043 1.36102 -0.283048
C  1.950421 -1.031608 0.159368
C  2.719277 0.120599 -0.102461
C  -2.438884 -0.62178 0.390097
C  -3.921732 -0.24187 0.427736
H  -0.044159 -1.85119 0.446673
H  -1.92914 1.326581 -0.002127
H  2.673127 2.250896 -0.485781
H  -4.331328 -0.47487 1.421442
H  -4.461759 -0.808118 -0.345108
