program: Gaussian 09
title: /home/michael/molsimp_comfiles/Ru_31a_3_OH/Ru_31a_3_OH.com auto generated
version: ES64L-G09RevE.01
frameworkgroup: C1[X(C28H22N6ORu)]
method: UTPSSh
basis: Gen
operation: Freq
keyword: #P
keyword: Geom=AllCheck
keyword: Guess=TCheck
keyword: SCRF=Check
keyword: GenChk
keyword: UTPSSh/ChkBas
keyword: Freq
title: /home/michael/molsimp_comfiles/Ru_31a_3_OH/Ru_31a_3_OH.com auto genera
converged: YES YES YES YES
polarizability: 7.55401125e+02 1.09527881e+01 6.63617470e+02 -7.46943748e+00 4.62812189e+01 4.55807371e+02
1716.lowfreq: -12.7427 -2.3840 -0.0004 0.0004 0.0007 9.7471 20.0666 29.0364 32.9839
frequency: 18.9215 28.8122 32.3011 39.8575 42.7427 53.5152 57.1603 85.5559 97.7241 107.1453 114.0053 124.6112 141.5496 149.9072 168.0810 171.5391 182.8567 184.9757 189.5572 211.4725 227.9131 240.2939 253.2793 257.1367 300.8886 304.7604 314.7078 348.8054 357.4267 389.6844 391.3619 403.5038 424.9833 434.5344 436.2456 455.1771 459.8217 463.8539 477.0093 499.9996 521.9680 531.5026 542.6865 546.0285 632.4841 636.7028 638.7761 647.4183 651.6009 652.6900 654.1838 666.1720 679.0747 700.0139 731.2643 739.1116 752.7958 760.7840 766.8415 768.3227 782.5841 782.9687 791.2466 797.2417 823.8295 836.0966 837.3421 845.3803 858.7972 888.9610 891.4054 910.5836 917.6256 939.5117 965.9279 974.6392 986.8215 990.6460 994.4590 998.9861 1001.0296 1023.6207 1025.0559 1030.5142 1030.6877 1031.1162 1031.1863 1032.7294 1033.8681 1035.6022 1049.7098 1050.5274 1061.5237 1079.0137 1089.3774 1095.1684 1098.2179 1106.2327 1117.7351 1130.4343 1143.9010 1155.8947 1164.5559 1171.6442 1172.5536 1181.0129 1182.5590 1188.4007 1230.0971 1237.1038 1244.3185 1285.8115 1307.3892 1311.8692 1316.3594 1321.7526 1323.2773 1328.7762 1335.1352 1347.9104 1365.8730 1380.2585 1388.9223 1433.0899 1436.9260 1450.6621 1476.2494 1479.5339 1484.8299 1486.6718 1495.0172 1513.0374 1525.2242 1537.7773 1542.2703 1584.4895 1606.6106 1615.0166 1618.3662 1621.4004 1625.7303 1639.2560 1647.3045 1651.3485 1654.2927 1661.6599 3211.0112 3217.8856 3220.7016 3226.7693 3229.8611 3231.3388 3231.5412 3232.5683 3233.4005 3233.5924 3237.3505 3240.1405 3241.8648 3246.7527 3247.4254 3248.2498 3251.8592 3252.7497 3253.5589 3254.0764 3260.3378 3262.3446
redmass: 5.4997 5.3597 5.3947 4.6497 5.4345 4.2268 5.5093 4.1534 6.1331 4.8363 4.7277 6.2279 5.4523 5.6404 5.4614 6.5463 4.6452 6.8326 6.3224 8.1554 6.1587 6.2717 5.7234 6.3463 6.2933 7.6784 10.6849 7.0848 8.3470 3.1496 2.9859 4.7157 3.4851 3.6897 3.9336 4.4744 4.2147 5.3553 3.0808 3.7909 3.1763 7.0644 6.8361 6.1108 3.7348 6.8160 7.3375 7.3503 6.7688 6.9682 6.4129 4.2993 6.8036 1.7323 6.7419 4.0075 2.1041 2.2446 1.3517 1.7777 2.0363 1.9536 3.6793 1.8196 16.8782 5.9441 2.3127 5.8351 1.3497 1.2532 1.4957 1.3696 1.3322 1.4095 1.3111 5.1769 1.3210 1.4050 1.3871 1.3605 1.4179 1.3168 1.3407 1.5650 5.0123 4.1814 1.3909 1.4294 6.4592 2.3078 6.5768 6.4274 7.3959 2.4553 1.7020 3.3003 2.0912 1.7607 1.8843 1.6899 1.6752 1.5303 1.6597 1.2058 1.0761 1.3404 1.0885 1.1456 1.4278 1.2295 2.7467 1.7839 2.1775 2.5661 2.9468 6.5032 7.7878 2.7926 3.0600 2.1018 4.0776 2.2844 1.2267 2.2248 5.1469 2.1599 2.1091 2.2807 2.3728 2.2675 2.3750 2.7879 1.9110 3.1096 2.7679 6.8272 5.8661 5.5846 5.5694 5.1487 5.8427 4.9504 5.5853 5.1232 5.1895 5.7222 1.0872 1.0895 1.0885 1.0955 1.0924 1.0893 1.0894 1.0897 1.0987 1.0905 1.0946 1.0920 1.0915 1.0953 1.0956 1.0958 1.0950 1.0962 1.0991 1.0991 1.0964 1.0937
irintensity: 0.0510 0.9996 0.1864 4.7109 1.8491 3.5212 5.3276 0.3382 1.7998 4.7927 2.5906 1.7587 1.5436 0.3451 2.8895 0.8200 7.6667 5.6369 1.3731 10.7772 4.1330 2.2150 4.8782 2.4918 4.8123 3.6405 23.1016 4.8962 9.1919 1.9216 1.3195 7.0861 1.3315 7.4584 10.4631 1.5830 2.7497 1.4005 8.3141 0.4497 8.9353 1.5619 0.5418 1.8537 0.1965 9.7322 7.2176 23.4503 10.3688 3.0441 4.7723 0.7817 12.4344 97.1801 0.9116 19.6572 0.4260 0.2316 58.1220 37.4953 135.5474 153.5777 8.7846 1.0268 166.3853 1.6147 6.2010 1.1685 84.4707 0.2562 7.8572 0.2950 0.6815 0.0160 2.1264 2.6874 0.7282 2.1043 0.7330 4.7521 0.6106 0.0342 0.2471 7.2488 20.1340 25.5960 2.3842 0.7375 12.4655 5.4735 1.1112 0.4520 20.0740 5.3040 36.2247 2.2560 0.2955 4.0472 26.4099 11.7623 7.2453 12.8676 4.3373 12.2296 1.9375 2.2596 5.2237 10.0260 12.3038 23.2556 21.6074 2.2109 18.7192 10.4948 36.5612 37.5308 1.2567 60.1811 11.8898 4.9732 64.3651 23.0790 6.4828 8.6494 72.3546 23.9284 0.7199 77.6969 36.9990 149.2277 17.5799 122.1050 4.9088 29.7123 22.9127 29.3180 26.8222 24.2135 23.6600 4.9770 36.3931 67.1002 47.2676 32.0555 64.9674 4.3336 0.1983 3.8593 2.9570 15.9372 1.1240 2.9969 6.7775 0.3055 20.4761 2.7070 2.2194 2.7709 2.1910 7.4822 4.7035 0.9230 1.5813 6.4800 3.7900 6.0744 2.6191 0.3454
temp: 298.150 k
press: 1.00000 atm
elementType: 44 6 6 6 6 6 6 6 6 6 6 6 6 6 6 7 7 7 6 1 1 1 1 1 1 1 1 1 1 1 7 6 6 6 6 6 6 6 6 7 1 1 1 1 1 1 7 6 6 6 6 6 1 1 1 1 1 8
symmnumber: 1
zpe: 1184123.7 jmol-1
zpe.correction: 0.451009 hartree
zpe.thermalcorrener: 0.480062 hartree
zpe.thermalcorrenthalpy: 0.481007 hartree
zpe.thermalcorrgfe: 0.389070 hartree
zpe.sumelectzpe: -1577.303235 hartree
zpe.sumelectthermal: -1577.274181 hartree
zpe.sumelectthermalent: -1577.273237 hartree
zpe.sumelectthermalfe: -1577.365174 hartree
dipole: 3.8578 -1.3345 5.3975
dipole: 6.7673
quadrupole: -67.4876 -106.6096 -187.4972
quadrupole: 8.0849 9.8657 5.3554
quadrupole: 53.0439 13.9218 -66.9657 8.0849 9.8657 5.3554
hfenergy: -1577.7542435 hartree
pointgroup: C01 [X(C28H22N6O1Ru1)]
dipole: 1.8702606 -0.749244 1.7405578 debye
polarizability: 742.7434464|16.5089264|656.5062451|-62.2234177|56.0585107|475.5762739 unknown
InChI: InChI=1S/C15H11N3.C8H6N2.C5H5N.O.Ru/c1-3-10-16-12(6-1)14-8-5-9-15(18-14)13-7-2-4-11-17-13;1-2-4-8-7(3-1)5-6-9-10-8;1-2-4-6-5-3-1;;/h1-11H;1-6H;1-5H;;/q-3;2*-1;;+5
charge 2 multiplicity 3
58 atoms
Ru -0.20362677 -0.01834474 -0.25733414
C  -0.05330039 -4.44278444 -0.33845903
C  1.3175732 -4.66179496 -0.45039922
C  2.18214511 -3.56743295 -0.50659185
C  1.65975735 -2.27552724 -0.45006336
C  2.49160014 -1.05605518 -0.50458285
C  3.88056742 -0.99134399 -0.64568249
C  4.49155811 0.26452098 -0.67902927
C  3.73760805 1.43537698 -0.57287428
C  2.35209268 1.32424644 -0.43467645
C  1.38744205 2.43324427 -0.28764859
C  1.75382131 3.77840045 -0.29373384
C  0.77267288 4.75603813 -0.1190408
C  -0.55305022 4.36787655 0.06391595
C  -0.86348207 3.00913781 0.05899047
N  0.07636707 2.06515061 -0.1154967
N  1.78812928 0.09475267 -0.40541918
N  0.30720424 -2.07321095 -0.33373108
C  -0.520176 -3.13116097 -0.28092996
H  -0.76021257 -5.26251412 -0.29344278
H  1.71663387 -5.66905348 -0.49358539
H  3.25046701 -3.72215466 -0.59134129
H  4.47710919 -1.8907754 -0.73044743
H  5.56819937 0.33102141 -0.78777916
H  4.21891229 2.40481587 -0.59586922
H  2.79061435 4.0588247 -0.43264114
H  1.04698747 5.80503685 -0.12390629
H  -1.34415126 5.09421014 0.20672102
H  -1.87795542 2.65649659 0.19786688
H  -1.57763121 -2.91421268 -0.19109789
N  -2.32200345 -0.10482801 0.00663882
C  -3.09974192 -0.75130574 -0.91128667
C  -4.46795747 -0.82794712 -0.77332174
C  -5.06667453 -0.22115572 0.34661027
C  -6.45951198 -0.22864776 0.6180114
C  -6.93554309 0.40272077 1.74660812
C  -6.05194814 1.06468204 2.64444642
C  -4.69582324 1.09160235 2.41048566
C  -4.17864375 0.44442171 1.25493972
N  -2.83196744 0.48780238 1.05801457
H  -2.56551553 -1.18786449 -1.7451113
H  -5.06284129 -1.34754941 -1.5166884
H  -7.12872173 -0.73381168 -0.07081925
H  -7.99951348 0.39911929 1.9599349
H  -6.45907027 1.55240013 3.52399101
H  -4.00772562 1.590465 3.0845523
N  0.02571042 -0.21236304 1.95305233
C  -0.67784685 -1.16889816 2.60151392
C  -0.60311552 -1.35003631 3.97799101
C  0.22663715 -0.51388041 4.72737798
C  0.95384539 0.47493873 4.06342246
C  0.82851458 0.59348082 2.68277237
H  -1.31563403 -1.80028002 1.99474836
H  -1.18874314 -2.13429354 4.44366446
H  0.30425046 -0.63053892 5.80316263
H  1.61185343 1.15101769 4.5970294
H  1.3826935 1.35458536 2.14765837
O  -0.45854701 0.07304739 -2.01505776
