program: Gaussian 09
title: 000031992
version: EM64L-G09RevD.01
frameworkgroup: C1[X(C14H15N3O2)]
method: RPBEPBE
basis: SDD
operation: Freq
keyword: #p
keyword: freq=noraman
keyword: PBEPBE/SDD
title: #p freq=noraman PBEPBE/SDD
converged: YES YES NO NO
title: Mulliken charges:
elementType: O O N N N C C C C C C C C C C C C C C H H H H H H H H H H H H H H H
charge: -0.358709 -0.266986 -0.115567 -0.661914 -0.003730 0.189192 0.171433 -0.514401 0.355023 -0.338193 -0.362332 0.317427 0.111248 -0.294080 -0.324025 -0.339265 -0.343778 -0.518674 -0.536945 0.273804 0.244970 0.243423 0.275795 0.221471 0.394847 0.308765 0.242256 0.239281 0.245173 0.231548 0.229387 0.218925 0.245062 0.219572
chargesum: 0.00000
title: Mulliken charges with hydrogens summed into heavy atoms:
elementType: O O N N N C C C C C C C C C C C C C C
charge: -0.358709 -0.266986 -0.115567 0.041697 -0.003730 0.189192 0.171433 -0.240598 0.355023 -0.093223 -0.118909 0.317427 0.111248 -0.018286 -0.102554 -0.097009 -0.104497 0.187433 0.146613
polarizability: 3.14232797e+02 8.55403822e+00 1.85729408e+02 -2.60441465e+00 -1.38644935e+01 9.67095123e+01
1716.lowfreq: -5.5557 -1.2013 -0.0007 -0.0005 -0.0003 6.7056 36.9583 41.0677 58.7930
frequency: 36.8694 41.0561 58.7705 78.5709 89.1652 106.9247 113.2213 140.3959 170.4138 186.9887 211.2449 231.0357 256.0384 260.9290 287.5675 311.6125 372.9530 375.3400 403.9155 427.3896 442.1924 472.0012 486.0684 520.2808 552.0428 568.8763 619.2470 654.4693 660.9989 671.3616 686.9960 715.8797 737.8586 749.0225 758.1796 781.6480 798.5171 838.3419 882.2962 891.5901 892.1923 926.1743 946.5132 958.2378 967.6368 990.4751 1001.6635 1043.3229 1056.5821 1082.2627 1108.4978 1111.3012 1116.3335 1146.4623 1150.8956 1152.9575 1171.0875 1189.0100 1216.6034 1238.2162 1266.2557 1303.4547 1322.9536 1360.8330 1370.9155 1400.3604 1406.2294 1428.7597 1436.4474 1457.0919 1466.4654 1466.6159 1471.7629 1472.9134 1476.1421 1548.8345 1555.1875 1578.6142 1584.8518 1620.8479 1638.0565 2956.1978 2972.4422 3042.8040 3069.0531 3119.2255 3123.5673 3125.1152 3138.4454 3146.7098 3149.6374 3172.9258 3177.9511 3179.6616 3351.6831 3624.8420
redmass: 3.8184 4.8570 3.9988 3.8718 3.0926 4.1174 4.5170 1.1563 3.7376 4.7289 1.9188 3.3842 4.3367 2.0078 5.2578 5.3430 2.9521 4.5626 5.1082 3.4822 3.4178 1.5476 4.2494 2.9712 4.3842 4.8091 3.7615 5.4549 6.5192 4.0518 4.9810 5.6286 3.6027 3.1282 1.2231 4.2233 1.5821 1.5417 1.6985 3.5395 1.3208 1.4238 6.4257 3.4815 1.7641 1.4312 4.1084 2.5571 2.0013 1.7035 1.7072 1.2678 1.2506 1.6515 1.8714 1.4085 1.9930 2.3000 1.3185 1.6831 3.3010 5.0839 1.6348 6.6396 3.6985 1.9655 3.2565 1.2972 1.1824 1.0570 1.1394 1.8360 1.5816 1.1117 1.4122 7.7015 6.1499 2.8227 4.3858 3.2288 2.4686 1.0332 1.0300 1.1038 1.1051 1.1026 1.0990 1.0871 1.0901 1.0883 1.0970 1.0952 1.0922 1.0955 1.0584 1.0917
irintensity: 0.5522 0.7035 6.0773 2.2112 3.9512 2.2449 1.8257 0.1912 2.0488 9.4832 0.8242 10.1227 0.5190 4.2777 1.9388 16.1216 1.2422 1.6251 19.9477 20.0154 18.2469 56.8133 14.2610 59.4771 4.1559 4.5834 8.8654 12.4859 0.7285 5.1746 25.8602 8.1898 1.8715 0.0943 104.3149 9.1871 46.8370 50.8229 35.7910 15.1584 4.0967 1.7702 49.0561 5.3592 1.5575 3.7599 96.9776 32.1612 15.9850 3.4614 20.0912 0.5543 0.4445 6.2815 5.4570 23.5263 159.6401 19.9927 0.4900 6.3312 67.7364 7.0433 3.1321 23.2270 83.6216 23.5896 13.1851 6.4104 14.1050 10.3101 13.1663 25.2973 117.3108 43.7009 6.8942 93.0347 51.3415 134.1918 159.5586 113.1676 283.1919 81.3186 51.7900 51.4391 31.7770 23.0370 26.4022 12.9901 26.0051 5.2861 23.8087 11.3930 1.4550 5.5694 146.0112 55.2043
temp: 298.150 k
press: 1.00000 atm
elementType: 8 8 7 7 7 6 6 6 6 6 6 6 6 6 6 6 6 6 6 1 1 1 1 1 1 1 1 1 1 1 1 1 1 1
symmnumber: 1
zpe: 700404.9 jmol-1
zpe.correction: 0.266770 hartree
zpe.thermalcorrener: 0.284502 hartree
zpe.thermalcorrenthalpy: 0.285446 hartree
zpe.thermalcorrgfe: 0.220426 hartree
zpe.sumelectzpe: -855.781074 hartree
zpe.sumelectthermal: -855.763342 hartree
zpe.sumelectthermalent: -855.762398 hartree
zpe.sumelectthermalfe: -855.827418 hartree
dipole: -3.3188 3.5570 -0.5328
dipole: 4.8939
quadrupole: -104.7448 -103.5910 -111.6196
quadrupole: 13.2015 -4.8526 0.5415
quadrupole: 1.9070 3.0608 -4.9678 13.2015 -4.8526 0.5415
hfenergy: -856.0478439 hartree
pointgroup: C01 [X(C14H15N3O2)]
dipole: -1.3296071 0.9320796 -1.0347063 debye
polarizability: 313.7564486|2.9947282|134.4183835|-11.9751452|-46.1912888|148.4968858 unknown
InChI: InChI=1S/C14H15N3O2/c1-18-11-3-4-13(19-2)12(9-11)17-14(15)10-5-7-16-8-6-10/h3-9H,15H2,1-2H3
charge 0 multiplicity 1
34 atoms
O  -1.013143 1.906876 -1.652206
O  -4.120616 -1.633666 1.464882
N  0.228222 -0.071784 0.294371
N  1.116402 0.245515 -1.936185
N  5.188728 -0.950582 0.989319
C  -1.152937 0.078611 0.044347
C  -1.786119 1.007871 -0.850276
C  -2.009599 -0.758564 0.810031
C  -3.41196 -0.72587 0.658599
C  -3.183954 1.046383 -0.98998
C  -4.017493 0.177944 -0.253019
C  2.594056 -0.325234 -0.056626
C  1.218729 -0.022346 -0.581137
C  2.744874 -1.025412 1.167482
C  3.776825 0.065288 -0.737383
C  4.040329 -1.31212 1.643677
C  5.033896 -0.267248 -0.182607
C  -0.48427 3.071205 -0.905766
C  -5.579781 -1.63611 1.352144
H  -1.560094 -1.45591 1.521529
H  -3.611577 1.765636 -1.696482
H  -5.101609 0.221562 -0.38635
H  1.848161 -1.321083 1.71813
H  3.74109 0.649908 -1.663331
H  0.285622 0.754369 -2.272977
H  1.891195 0.046623 -2.565222
H  4.18305 -1.855159 2.584473
H  5.960906 0.027353 -0.687921
H  0.168685 2.744283 -0.075168
H  -1.322624 3.67169 -0.507392
H  0.091882 3.662444 -1.634046
H  -6.009614 -0.656315 1.639431
H  -5.920981 -2.409897 2.055478
H  -5.905679 -1.896462 0.325879
