program: Gaussian 09
title: /home/michael/molsimp_comfiles/Ru_31a_27_OH/Ru_31a_27_OH.com auto generated
version: ES64L-G09RevE.01
frameworkgroup: C1[X(C20H14N4O5Ru)]
method: UTPSSh
basis: Gen
operation: Freq
keyword: #P
keyword: Geom=AllCheck
keyword: Guess=TCheck
keyword: SCRF=Check
keyword: GenChk
keyword: UTPSSh/ChkBas
keyword: Freq
title: /home/michael/molsimp_comfiles/Ru_31a_27_OH/Ru_31a_27_OH.com auto gene
converged: YES YES NO YES
polarizability: 6.61974441e+02 2.10672145e+01 4.00725664e+02 -4.46954276e+01 -5.85872495e+01 4.71919927e+02
1716.lowfreq: 0.0005 0.0008 0.0009 10.7083 16.1863 21.0221 26.7340 36.4680 39.4620
frequency: 23.5547 34.9557 37.7596 42.7885 47.7340 73.2581 76.9770 95.8880 116.7984 143.0151 152.5623 164.5118 171.3003 174.5146 178.5332 189.8805 199.5698 212.3839 229.4042 256.5142 272.0231 282.7208 286.2339 309.3283 336.7831 387.7436 395.3852 404.7822 414.6166 430.6968 435.5553 457.9344 471.1372 476.4779 492.9047 529.5733 559.7051 561.1738 593.6465 639.8998 643.2091 653.5582 661.8794 675.8991 681.9048 701.5891 714.7624 765.9909 767.8702 768.2852 779.3468 783.1182 788.8182 791.8811 799.5519 850.4979 854.8068 855.2628 888.8777 894.3695 916.7473 966.3852 972.5220 976.0441 989.7099 1001.2241 1001.5471 1026.6799 1033.5132 1034.2046 1036.1377 1037.1746 1049.0466 1050.4997 1088.1311 1096.5363 1104.4050 1105.7977 1146.2338 1155.3982 1156.5261 1173.3200 1173.8930 1179.0511 1181.3832 1232.2505 1253.8160 1265.3622 1285.3634 1319.0690 1325.1027 1330.5604 1343.1206 1384.8249 1391.2693 1440.1342 1450.3142 1451.6304 1481.7648 1488.5084 1512.8990 1519.6583 1537.3543 1581.9406 1617.1946 1618.4435 1618.5451 1638.0694 1652.9739 1658.1003 1669.7999 1685.5075 3213.8731 3221.3473 3223.2293 3229.2185 3234.6957 3234.9533 3236.7972 3238.0945 3239.5787 3247.5529 3249.0309 3253.5673 3254.1143 3255.9123
redmass: 4.9521 5.5362 6.4405 6.0944 5.3760 6.5916 7.2769 9.7582 7.0502 7.1588 8.1356 10.3964 7.9266 4.2121 4.8356 6.5616 8.0787 8.5295 7.5296 10.3455 16.2562 10.7735 8.5752 11.4048 14.6101 3.5920 2.7060 4.5857 12.6636 3.9600 11.5926 4.0059 5.9140 3.1146 3.7507 7.0991 9.7380 9.0811 7.2903 7.0973 6.8075 6.3953 4.5478 7.7265 7.6991 1.8036 11.5037 1.4213 1.8115 1.7626 5.5210 7.8815 10.4967 3.7491 16.3255 5.6121 1.8881 1.5475 1.2470 1.4921 8.2996 1.3912 1.2992 5.0925 1.3245 1.3643 1.4209 1.3273 2.2817 1.3263 6.6166 1.3640 6.4815 6.0272 1.7181 1.9584 2.1450 2.3654 4.4050 3.8436 1.6890 1.0820 1.1646 1.1961 1.3459 1.2189 2.6740 2.4512 1.7817 7.9121 4.4774 5.5805 2.9814 1.2181 4.8129 4.5825 2.6541 2.7860 2.2940 2.4824 3.2083 1.9296 3.0621 6.8484 5.8426 5.3804 7.1959 6.9359 5.1962 5.5822 13.1056 13.0260 1.0877 1.0899 1.0887 1.0956 1.0898 1.0918 1.0986 1.0904 1.0947 1.0972 1.0938 1.0980 1.0981 1.0962
irintensity: 0.5787 2.8361 5.6366 2.1509 0.5460 13.5624 3.0021 9.0907 3.0414 6.2308 1.1382 6.6686 3.6209 13.9435 0.3772 2.0304 17.0713 1.8807 2.8998 8.8070 122.8885 30.4655 29.1448 54.6027 53.6816 1.2548 0.0127 7.7139 36.0489 15.4195 72.7744 6.0800 0.0622 12.5399 1.8196 0.6227 25.8144 1.8676 5.2098 20.0095 7.0581 4.3719 0.3098 58.0095 41.6684 95.9210 171.4862 73.9263 49.6377 38.0649 34.9851 0.2638 23.9404 5.3760 114.7458 14.4273 61.0087 42.5155 0.1436 7.5046 90.4184 0.0132 2.2638 4.8933 0.5472 3.3556 0.6656 0.0243 5.3525 0.0507 25.5362 0.5123 5.0852 57.4547 47.0873 139.4591 24.9499 33.3342 205.6618 357.3753 53.5863 4.1657 15.4278 8.2320 16.5684 27.7861 7.1062 1.1187 1.5465 1048.0352 65.7491 21.1051 7.6170 5.2195 74.6604 96.1927 59.9569 13.8704 88.0833 22.8270 54.9723 3.2341 8.5093 28.3706 59.3694 18.2977 45.4777 7.3752 73.4454 32.3449 2607.1626 434.4580 0.2042 3.7882 3.8144 12.3635 0.4779 2.1805 18.2890 1.8701 0.3374 4.8970 5.8350 2.3383 5.6881 10.1493
temp: 298.150 k
press: 1.00000 atm
elementType: 44 8 6 8 6 6 6 6 6 6 8 8 7 1 1 1 7 6 6 6 6 6 6 6 6 7 1 1 1 1 1 1 7 6 6 6 6 6 1 1 1 1 1 8
symmnumber: 1
zpe: 827931.6 jmol-1
zpe.correction: 0.315343 hartree
zpe.thermalcorrener: 0.340405 hartree
zpe.thermalcorrenthalpy: 0.341349 hartree
zpe.thermalcorrgfe: 0.257863 hartree
zpe.sumelectzpe: -1459.237941 hartree
zpe.sumelectthermal: -1459.212879 hartree
zpe.sumelectthermalent: -1459.211935 hartree
zpe.sumelectthermalfe: -1459.295421 hartree
dipole: -3.5884 11.1459 0.3638
dipole: 11.7150
quadrupole: -49.4305 -146.5968 -209.8812
quadrupole: -4.5002 11.8055 0.5192
quadrupole: 85.8723 -11.2940 -74.5784 -4.5002 11.8055 0.5192
hfenergy: -1459.5532839 hartree
pointgroup: C01 [X(C20H14N4O5Ru1)]
dipole: 1.3381689 4.406565 -0.1858047 debye
polarizability: 661.3236659|-16.2895734|400.7592848|-48.1110311|58.4775747|472.5370812 unknown
InChI: InChI=1S/C8H6N2.C7H3NO4.C5H5N.O.Ru/c1-2-4-8-7(3-1)5-6-9-10-8;9-6(10)4-2-1-3-5(8-4)7(11)12;1-2-4-6-5-3-1;;/h1-6H;1-3H;1-5H;;/q-1;-3;-1;;+5
charge 1 multiplicity 4
44 atoms
Ru -0.37990597 -0.54959636 0.27988388
O  -2.8945698 -0.39880373 3.54513765
C  -2.39431696 -0.47877013 2.42575346
O  -1.10365276 -0.28244328 2.19328682
C  -3.17764656 -0.78369453 1.18464307
C  -4.54957141 -0.99895992 1.0850493
C  -5.09144289 -1.25975962 -0.17842401
C  -4.26364295 -1.30655991 -1.30553082
C  -2.90042668 -1.08797455 -1.13125193
C  -1.83734507 -1.10668988 -2.18526037
O  -0.62031131 -0.89768779 -1.69769136
O  -2.05352902 -1.29703759 -3.37828404
N  -2.40738952 -0.83196544 0.08877885
H  -5.16641295 -0.96164842 1.97518076
H  -6.15676719 -1.42968479 -0.28467561
H  -4.65410268 -1.50964639 -2.29578895
N  1.7185803 -0.13696369 0.34663854
C  2.14713505 0.9132102 1.10249075
C  3.49231035 1.17398056 1.24652635
C  4.41172715 0.33589833 0.59044942
C  5.8201474 0.48291519 0.66583098
C  6.63205934 -0.40351797 -0.00783223
C  6.08128209 -1.46366418 -0.78294658
C  4.72017667 -1.63464631 -0.88147737
C  3.85965732 -0.73682088 -0.19141961
N  2.52119051 -0.94828578 -0.28747332
H  1.37381855 1.50238439 1.57891022
H  3.82400224 2.00596686 1.85774436
H  6.23482949 1.29162279 1.25832291
H  7.71045451 -0.29840781 0.05025801
H  6.75100078 -2.14353791 -1.29866776
H  4.28215095 -2.43739116 -1.46435661
N  -0.69535221 1.58802933 -0.24625002
C  -1.36390243 2.45668287 0.5446781
C  -1.51239365 3.79677039 0.20437107
C  -0.94530701 4.26188876 -0.98368472
C  -0.24467127 3.36534445 -1.7935072
C  -0.1398847 2.0377244 -1.39523736
H  -1.78004708 2.0598262 1.4622199
H  -2.06201712 4.45575548 0.86636483
H  -1.04522529 5.30300054 -1.27174595
H  0.21700466 3.68071496 -2.72196118
H  0.38948841 1.30480264 -1.99253241
O  -0.05866429 -2.27495034 0.58367815
