program: Gaussian 09
title: /home/michael/molsimp_comfiles/Ru_31a_18_OH/Ru_31a_18_OH.com auto generated
version: ES64L-G09RevE.01
frameworkgroup: C1[X(C24H18N4O4Ru)]
method: UTPSSh
basis: Gen
operation: Freq
keyword: #P
keyword: Geom=AllCheck
keyword: Guess=TCheck
keyword: SCRF=Check
keyword: GenChk
keyword: UTPSSh/ChkBas
keyword: Freq
title: /home/michael/molsimp_comfiles/Ru_31a_18_OH/Ru_31a_18_OH.com auto gene
converged: YES YES NO YES
polarizability: 6.16220682e+02 -6.02301736e+01 6.96679465e+02 2.81215093e+01 -7.73001528e+00 3.77952054e+02
1716.lowfreq: -5.9037 -0.0006 0.0003 0.0008 3.2412 12.7783 21.0448 24.3824 34.6798
frequency: 20.0534 22.3243 34.2835 37.3118 41.8903 51.0362 59.2263 70.6197 99.4489 105.1510 123.7951 144.9059 146.5016 162.6119 166.6639 174.5834 194.6425 200.0265 214.0455 221.1095 234.3050 256.4001 280.6680 292.0612 302.2846 307.1324 335.4450 348.2531 354.1154 391.6298 398.0351 418.0896 431.1706 446.8747 451.7550 480.3438 486.1949 506.8402 534.5698 554.1505 578.4226 590.1318 612.4711 628.8071 638.5031 642.9500 650.5153 651.8868 659.8375 696.8035 700.3758 703.2341 703.7396 741.6855 748.9335 760.2433 767.7394 771.3355 772.6096 803.0872 808.6276 820.8781 859.6029 860.9264 890.1039 892.7251 895.2184 926.4405 947.5448 969.1415 969.2232 985.0187 991.5023 1000.9931 1001.5917 1004.4551 1026.2166 1026.9647 1027.2297 1029.1524 1035.1391 1045.6464 1047.9115 1065.9187 1076.2763 1087.9341 1090.0111 1097.9659 1098.1054 1111.7883 1163.4380 1170.3122 1170.6820 1171.0054 1185.5179 1218.1491 1227.9055 1231.5471 1253.6184 1264.2234 1303.1964 1305.6861 1323.1354 1326.9194 1336.3830 1346.6778 1372.6011 1379.9134 1384.0142 1427.9866 1429.9692 1466.7771 1475.0139 1477.6820 1483.7435 1504.2454 1517.3922 1520.5208 1524.5787 1541.9063 1561.6722 1591.7507 1619.8044 1620.2029 1640.9399 1648.1157 1651.3440 1654.3854 1663.8921 3195.5612 3205.5728 3211.0560 3214.3021 3216.6951 3218.8722 3226.6820 3227.4685 3228.9966 3230.4147 3233.4547 3234.6513 3234.8103 3242.2431 3243.1132 3246.9901 3247.5893 3617.4800
redmass: 5.8772 5.8751 5.4487 4.0562 6.1065 6.1832 4.3282 4.9282 5.8681 8.9640 5.2619 6.3046 6.0471 6.2848 6.6515 7.3031 6.3920 7.1974 7.2806 7.4062 7.3124 10.9050 8.9808 5.1727 11.6926 14.9636 10.2108 7.4339 6.0129 2.6755 2.7160 9.4555 4.0016 2.7118 4.2454 4.4023 3.8487 1.8571 3.5659 6.8681 3.9216 7.0123 7.7605 6.9048 7.7824 6.9124 6.3401 6.3342 5.7514 6.1935 4.4591 1.7996 1.7679 5.5128 3.7673 1.6674 1.7499 1.7660 1.7940 10.8867 15.1702 2.8901 2.7449 2.2211 1.2460 1.2478 6.4479 1.3970 1.3410 1.3087 1.3100 1.2911 1.2791 1.4191 1.4322 8.2126 5.9437 2.3725 2.0816 1.3180 6.3103 5.7341 6.6656 2.1857 1.8507 1.7029 1.7073 1.7551 1.6996 3.0046 1.3750 1.3402 1.0879 1.0845 1.4403 2.3938 1.2177 1.2310 1.8170 2.9495 2.3431 2.8150 7.8256 8.1501 5.4773 4.2684 5.3589 1.2289 1.2295 3.3162 4.5462 4.2841 2.7916 2.2416 2.2795 2.6259 1.9755 1.9329 3.8350 9.5309 4.2330 5.4103 5.4744 5.3180 7.6147 5.9326 5.1888 5.2505 6.2767 1.0862 1.0873 1.0945 1.0876 1.0882 1.0883 1.0976 1.0916 1.0890 1.0890 1.0941 1.0970 1.0941 1.0956 1.0964 1.0977 1.0985 1.0827
irintensity: 9.0781 3.0526 8.7302 0.1772 4.5896 4.0597 3.9743 1.7038 1.3797 3.4141 0.5836 0.6366 4.5933 2.2773 4.5129 1.4855 17.2328 4.0556 7.5414 12.0341 4.7326 13.0464 5.9673 2.1123 35.2473 73.2778 38.2474 85.7304 3.8506 0.1860 0.0535 1.9161 17.3145 35.6196 16.9178 4.2619 26.9240 119.6490 3.7949 46.7132 1.1726 23.8933 27.9777 10.0175 14.4384 3.8357 0.6345 0.9275 3.3825 4.0510 5.3964 55.1325 135.7831 17.7642 6.6975 200.4405 41.7925 4.7726 59.2815 187.6150 277.7181 3.8774 34.9300 30.8329 0.7468 0.1854 37.4572 0.4794 4.3606 3.6413 1.6703 1.2595 0.3923 0.9167 0.1921 0.5493 17.8978 9.5562 8.4665 0.1774 5.3281 2.8179 2.1341 21.1115 35.5471 31.5952 30.5127 1.1794 2.8731 16.8761 59.7245 17.1188 2.4018 1.9899 15.6708 159.2804 18.0133 28.7854 36.0990 178.4820 159.0181 282.4027 2.9401 19.2850 176.9759 454.7306 187.0776 2.3267 6.1261 32.4830 158.2920 108.6268 159.6597 59.1340 53.4636 460.3981 18.1783 9.5049 581.0186 1171.8159 396.5215 47.6891 2.2188 6.1249 136.0711 70.8856 53.2060 30.0381 52.0046 6.3689 1.6888 44.2751 4.6798 3.9121 3.2534 37.5948 4.5135 0.4840 0.9333 1.8440 16.1395 1.7807 14.6799 9.0011 12.9201 7.2453 279.0763
temp: 298.150 k
press: 1.00000 atm
elementType: 44 8 6 8 6 6 6 6 6 7 6 6 6 6 6 6 6 8 7 6 1 1 1 1 1 1 1 1 7 6 6 6 6 6 1 1 1 1 1 7 6 6 6 6 6 1 1 1 1 1 8
symmnumber: 1
zpe: 1000358.7 jmol-1
zpe.correction: 0.381017 hartree
zpe.thermalcorrener: 0.408679 hartree
zpe.thermalcorrenthalpy: 0.409623 hartree
zpe.thermalcorrgfe: 0.320017 hartree
zpe.sumelectzpe: -1539.051705 hartree
zpe.sumelectthermal: -1539.024043 hartree
zpe.sumelectthermalent: -1539.023099 hartree
zpe.sumelectthermalfe: -1539.112705 hartree
dipole: -0.0862 10.2029 13.6566
dipole: 17.0473
quadrupole: -105.9622 -217.9409 -195.1372
quadrupole: 10.7597 0.9016 -16.5640
quadrupole: 67.0512 -44.9275 -22.1238 10.7597 0.9016 -16.5640
hfenergy: -1539.4327217 hartree
pointgroup: C01 [X(C24H18N4O4Ru1)]
dipole: 1.8243477 3.1501913 5.6330127 debye
polarizability: 601.0110661|-43.7983654|702.4138309|-38.5548336|51.8917262|387.4273049 unknown
InChI: InChI=1S/C14H8N2O3.2C5H5N.O.Ru/c17-11-7-2-1-4-8(11)13-15-10-6-3-5-9(14(18)19)12(10)16-13;2*1-2-4-6-5-3-1;;/h1-7,15H;2*1-5H;;/q-3;2*-1;;+5
charge 0 multiplicity 3
51 atoms
Ru -0.10580664 0.31787388 -0.54706969
O  0.54970373 -3.75526787 -1.54308042
C  0.8136664 -2.55837971 -1.26759803
O  -0.14210436 -1.74488085 -0.90901772
C  2.23498871 -2.09398936 -1.33398744
C  3.26028385 -2.99457655 -1.66185743
C  4.60897356 -2.60553881 -1.71413008
C  5.01004245 -1.29371189 -1.44343905
C  3.99835898 -0.39207449 -1.11907769
N  4.01079593 0.96003485 -0.80944852
C  2.72978292 1.37949042 -0.58311157
C  2.32670779 2.73271652 -0.26195886
C  3.31283186 3.75060895 -0.22354453
C  3.00121421 5.06630861 0.07445747
C  1.6645844 5.40565731 0.34751483
C  0.67641069 4.43510002 0.31664493
C  0.96205011 3.07946668 0.01343801
O  -0.08611599 2.25615773 0.03320884
N  1.90059834 0.33335681 -0.7246702
C  2.64373557 -0.77657272 -1.06039807
H  2.99287592 -4.02308224 -1.87770463
H  5.36011497 -3.34452494 -1.97252382
H  6.05117394 -0.99364785 -1.48706097
H  4.84088601 1.53892027 -0.77124418
H  4.34740874 3.50068324 -0.43813823
H  3.78068173 5.82030885 0.0915622
H  1.39885378 6.43245967 0.58126554
H  -0.3588921 4.68868414 0.52390229
N  -2.20693868 0.26148856 -0.16481186
C  -2.77850938 -0.8017358 0.44091949
C  -4.13703204 -0.8374465 0.73903454
C  -4.93398749 0.25814672 0.40093349
C  -4.33984357 1.35556869 -0.22605165
C  -2.97441018 1.32366883 -0.49102046
H  -2.11972821 -1.62853551 0.67983198
H  -4.55316171 -1.71153786 1.22669374
H  -5.99639851 0.25675109 0.6211417
H  -4.91780186 2.22815658 -0.50852175
H  -2.46426087 2.1495857 -0.97242119
N  0.11856684 -0.11737245 1.66781453
C  -0.50338498 0.68279845 2.56049841
C  -0.4417047 0.45858577 3.93256094
C  0.28781374 -0.63382582 4.40693966
C  0.9277549 -1.46500234 3.48572486
C  0.81744572 -1.17640588 2.12802411
H  -1.05344555 1.52001994 2.14634225
H  -0.95785579 1.13100431 4.60854823
H  0.35459851 -0.83348052 5.4714485
H  1.50411031 -2.32606379 3.8046539
H  1.29748773 -1.79976408 1.38325714
O  -0.39173073 0.70272924 -2.26555452
