program: Gaussian 09
title: /home/michael/molsimp_comfiles/Ru_31a_17_OH/Ru_31a_17_OH.com auto generated
version: ES64L-G09RevE.01
frameworkgroup: C1[X(C28H21N4O4Ru)]
method: UTPSSh
basis: Gen
operation: Freq
keyword: #P
keyword: Geom=AllCheck
keyword: Guess=TCheck
keyword: SCRF=Check
keyword: GenChk
keyword: UTPSSh/ChkBas
keyword: Freq
title: /home/michael/molsimp_comfiles/Ru_31a_17_OH/Ru_31a_17_OH.com auto gene
converged: YES YES NO YES
polarizability: 7.93315145e+02 5.90123405e+00 7.80137149e+02 -1.82650872e+01 -4.01088084e+01 4.19439321e+02
1716.lowfreq: -12.3655 -0.0005 -0.0004 0.0005 2.0688 11.8026 22.0549 25.5776 31.3328
frequency: 21.9664 24.2840 30.9347 33.2171 37.2093 54.8745 60.6959 76.5092 84.6546 111.8393 124.9970 125.9121 142.7081 152.9550 166.4175 181.2206 183.9588 186.9131 198.8664 206.9746 225.4528 225.6736 240.8576 267.1775 274.7021 286.6048 300.3382 314.4060 322.1608 338.3415 346.2736 363.0171 386.1404 395.7775 396.2691 418.1690 434.7843 450.8184 472.6863 474.1180 479.8010 489.1649 498.9152 502.2726 522.8717 536.8490 545.1517 545.8455 580.0429 588.7915 612.7612 638.7556 643.1921 644.6605 650.5561 652.0970 657.7345 695.6301 697.8324 700.7624 741.7756 750.9031 762.4401 762.7943 770.7855 772.0039 777.0557 788.5079 806.6463 821.7241 832.3330 845.9351 859.2964 862.5946 886.3531 888.2996 893.8911 911.7543 927.4161 940.9735 948.7831 963.9926 966.5724 974.4770 984.5943 985.7322 989.9242 999.4876 1000.6551 1013.1248 1023.6317 1027.2548 1031.2647 1040.1545 1048.7522 1063.0359 1067.0163 1075.2070 1087.9820 1102.7349 1105.1620 1156.3019 1156.9998 1169.7513 1170.7981 1174.8330 1180.5367 1193.2493 1216.6825 1231.1475 1243.1945 1246.3692 1256.7850 1279.7754 1293.8477 1294.9524 1305.9164 1323.1640 1328.2458 1343.0446 1365.5874 1375.0702 1382.4809 1409.8336 1424.1993 1430.7266 1433.5522 1463.5574 1473.1747 1474.3170 1480.3855 1492.8839 1507.0179 1519.1536 1524.4553 1541.8108 1541.9880 1556.6935 1591.0218 1607.5189 1619.0929 1635.6418 1641.4858 1646.0796 1651.9719 1658.9043 1673.1266 3193.6144 3197.1862 3197.8334 3202.3953 3209.7145 3212.3959 3212.8469 3216.3432 3217.7477 3218.0307 3222.4600 3224.8948 3227.4035 3229.5038 3233.4284 3235.1579 3244.8581 3245.1054 3251.6141 3621.6817 3736.9496
redmass: 6.2514 5.6213 6.4478 5.8194 4.5353 5.3830 4.4520 5.0758 6.3452 6.0667 6.0357 5.5304 6.0179 6.8711 5.9346 6.7920 4.3640 4.7318 6.2581 7.1956 6.8568 6.0298 10.0747 5.8134 8.3759 5.9666 4.2595 2.3854 2.7751 8.1843 6.2730 5.3348 4.4925 3.1251 2.7175 10.3218 1.7426 3.9349 2.6676 5.2043 3.2667 9.9645 3.3254 3.8949 6.8409 3.7640 6.4607 7.1113 3.9523 6.7457 7.8873 6.8497 6.6715 7.3127 3.6606 6.2292 5.6625 5.2199 5.7379 1.7795 5.4723 4.3534 1.3407 1.5756 1.6261 1.7511 3.6639 4.7408 10.5906 2.8574 6.1135 1.3752 5.7425 1.5539 1.4065 1.2520 6.2253 1.1092 1.3939 1.4401 1.3459 4.9329 1.3316 1.3156 1.2860 1.3779 1.2754 1.5918 4.9534 1.2949 5.8311 1.3083 6.9990 2.3747 6.3346 2.6108 2.2440 1.8767 1.7046 1.8284 2.8524 1.5335 1.4939 1.3648 1.0783 1.1178 1.2062 1.3669 2.3341 1.2163 1.6419 2.1309 3.1877 1.6353 1.9119 2.0478 2.7603 8.1082 5.8851 4.8968 6.3346 3.5413 1.2271 1.7619 4.9910 7.0775 3.2492 4.3910 2.7444 2.4876 2.2808 2.0944 2.5940 1.9596 3.7686 7.7723 3.3997 5.2023 5.6594 6.3475 5.2831 7.8501 5.1767 5.6504 5.2526 6.9037 6.0747 1.0865 1.0891 1.0865 1.0890 1.0939 1.0950 1.0876 1.0908 1.0914 1.0880 1.0982 1.0974 1.0915 1.0900 1.0966 1.0953 1.0957 1.0956 1.0960 1.0826 1.0665
irintensity: 3.7598 2.0025 12.5954 2.3265 1.8448 1.7754 1.2155 2.0013 2.3726 0.9122 1.2324 1.7367 6.5551 2.6708 0.7821 0.4353 0.9911 3.5473 3.6223 3.4794 2.7109 2.2804 6.4562 15.4523 15.8001 4.7281 8.9373 158.0811 55.1289 35.0722 160.7672 2.1751 11.2467 0.1672 0.2596 1.7821 78.7304 15.7712 18.3423 75.7727 10.5492 268.4536 100.8254 10.1722 1.1547 4.4077 37.7388 17.0382 2.3741 8.8378 25.1223 1.5227 8.9981 24.7308 15.8688 0.7869 5.5497 5.0634 6.7362 92.6193 7.5950 8.9793 14.2176 225.4090 21.0497 43.0113 5.2343 0.0289 143.4332 2.1370 3.5506 79.7399 64.7269 7.0992 15.0636 0.2688 28.9186 122.1930 0.4447 10.9788 5.3633 0.4364 3.4247 0.5076 1.2309 6.0209 0.3297 0.7653 10.4397 0.0130 15.6100 0.0764 5.7466 8.8338 1.7942 7.7872 12.6033 33.6136 24.2289 2.7437 37.1354 41.0002 3.6725 16.7262 1.8046 3.2531 6.3267 3.9112 176.1349 11.6560 8.3438 10.9546 179.9142 3.8886 94.6890 181.2977 303.4629 3.5328 34.2983 587.2916 187.7171 1.1913 4.6986 30.5996 129.1682 17.9628 11.6751 60.7450 151.2434 17.4393 55.9544 0.9621 341.4815 37.9759 445.7953 1227.9124 155.8723 205.1861 45.5768 6.2851 1.7898 87.6706 8.5391 58.3710 25.8441 26.5994 18.0860 14.0327 4.1425 1.4783 0.5225 36.2448 33.3144 5.0695 5.6162 1.3329 2.2873 38.1654 43.9721 4.4671 1.4636 20.4816 3.5990 14.1405 4.8613 14.1013 300.4754 39.0055
temp: 298.150 k
press: 1.00000 atm
elementType: 44 8 6 8 6 6 6 6 6 7 6 6 6 6 6 6 6 8 7 6 1 1 1 1 1 1 1 1 7 6 6 6 6 6 6 6 6 6 1 1 1 1 1 1 1 7 6 6 6 6 6 1 1 1 1 1 8 1
symmnumber: 1
zpe: 1150604.7 jmol-1
zpe.correction: 0.438242 hartree
zpe.thermalcorrener: 0.468901 hartree
zpe.thermalcorrenthalpy: 0.469845 hartree
zpe.thermalcorrgfe: 0.375255 hartree
zpe.sumelectzpe: -1693.289058 hartree
zpe.sumelectthermal: -1693.258400 hartree
zpe.sumelectthermalent: -1693.257455 hartree
zpe.sumelectthermalfe: -1693.352046 hartree
dipole: 3.8106 9.6007 10.4361
dipole: 14.6835
quadrupole: -114.7325 -240.9555 -208.2270
quadrupole: -7.8902 -6.3803 -10.8245
quadrupole: 73.2391 -52.9838 -20.2553 -7.8902 -6.3803 -10.8245
hfenergy: -1693.7273006 hartree
pointgroup: C01 [X(C28H21N4O4Ru1)]
dipole: 2.0144506 3.552382 4.0860017 debye
polarizability: 767.6436738|5.977185|786.1778615|-93.2005436|-11.5635756|439.0700796 unknown
InChI: InChI=1S/C14H8N2O3.C9H7N.C5H5N.H2O.Ru/c17-11-7-2-1-4-8(11)13-15-10-6-3-5-9(14(18)19)12(10)16-13;1-2-4-9-7-10-6-5-8(9)3-1;1-2-4-6-5-3-1;;/h1-7,15H;1-7H;1-5H;1H2;/q-3;2*-1;;+6/p-1
charge 0 multiplicity 2
58 atoms
Ru -0.12955846 0.21359675 -0.2901247
O  0.48250976 -3.9451835 -0.7736505
C  0.75092631 -2.71990917 -0.70191629
O  -0.17649762 -1.86690486 -0.35804976
C  2.14769514 -2.2658233 -0.99857486
C  3.13058234 -3.19460005 -1.37297868
C  4.45640086 -2.8129762 -1.64219236
C  4.87623086 -1.48269657 -1.55203053
C  3.90743072 -0.55126063 -1.1814684
N  3.94346906 0.82228261 -1.00783189
C  2.69125986 1.25558175 -0.65375751
C  2.31392946 2.63020675 -0.39385359
C  3.30943914 3.63606689 -0.43374683
C  3.01935648 4.96947217 -0.19000768
C  1.69682527 5.33740483 0.10866661
C  0.69914373 4.37555719 0.15759426
C  0.96317356 3.00609993 -0.09174817
O  -0.09582182 2.19344644 -0.01482143
N  1.86414222 0.20522396 -0.58171946
C  2.5750119 -0.92754382 -0.90875614
H  2.85095239 -4.23914579 -1.45464458
H  5.17449146 -3.57430937 -1.92861102
H  5.89922037 -1.19086252 -1.76266111
H  4.760381 1.40643509 -1.1365707
H  4.33600019 3.36045631 -0.65579481
H  3.80734468 5.71394119 -0.22838771
H  1.44886544 6.37658721 0.30398795
H  -0.32636403 4.64894632 0.38752561
N  -2.22863715 0.21790642 -0.0708033
C  -2.97135834 1.22366702 -0.64213206
C  -4.33800417 1.29171684 -0.52507638
C  -5.03917122 0.29706838 0.20720637
C  -6.44840686 0.29021761 0.37622488
C  -7.05097095 -0.71736931 1.1031692
C  -6.28003783 -1.75506521 1.68986838
C  -4.90904758 -1.77509209 1.54359122
C  -4.26386537 -0.74990585 0.79990889
C  -2.86024785 -0.72791361 0.62336452
H  -2.40563504 1.96429895 -1.19369262
H  -4.87894792 2.10670824 -0.99500447
H  -7.03871982 1.08351421 -0.07243489
H  -8.12921985 -0.72084713 1.23073971
H  -6.77881181 -2.53550804 2.25583607
H  -4.30902887 -2.56418698 1.9873618
H  -2.24453768 -1.50946021 1.05655638
N  0.04174197 0.04305809 1.83526152
C  0.85507149 -0.86363186 2.42197313
C  0.95224353 -0.99337585 3.80399013
C  0.19023536 -0.15549147 4.62025644
C  -0.64604449 0.78563839 4.01638324
C  -0.6976449 0.8529138 2.62798803
H  1.43762874 -1.49134701 1.75961006
H  1.61997751 -1.73812539 4.22207911
H  0.24764679 -0.23309556 5.70090514
H  -1.2572456 1.46062421 4.60476689
H  -1.33148059 1.56863158 2.11844374
O  -0.38414759 0.35456959 -2.26594251
H  0.48420784 0.25780559 -2.69390533
