program: Gaussian 09
title: /home/michael/molsimp_comfiles/Ru_31a_15_OH/Ru_31a_15_OH.com auto generated
version: ES64L-G09RevE.01
frameworkgroup: C1[X(C27H19N5O4Ru)]
method: UTPSSh
basis: Gen
operation: Freq
keyword: #P
keyword: Geom=AllCheck
keyword: Guess=TCheck
keyword: SCRF=Check
keyword: GenChk
keyword: UTPSSh/ChkBas
keyword: Freq
title: /home/michael/molsimp_comfiles/Ru_31a_15_OH/Ru_31a_15_OH.com auto gene
converged: YES YES NO YES
polarizability: 7.76545948e+02 3.71078074e+01 7.29831146e+02 2.14325536e+01 5.36029236e+01 4.38771314e+02
1716.lowfreq: -0.0006 0.0004 0.0007 3.5776 11.3837 15.5065 21.2611 25.2538 34.2403
frequency: 20.8349 25.2018 33.9621 37.2411 40.4065 49.7551 61.1907 76.7169 103.7758 111.9963 124.5841 137.2546 140.9538 153.5293 165.5427 174.1919 181.8825 187.6197 193.4946 213.4078 218.6737 224.6345 246.9731 256.1683 273.3931 293.3605 297.5460 305.6827 335.8225 352.1201 361.2713 390.5286 396.5448 405.5340 417.9559 435.5012 458.5444 476.8928 481.4847 491.7640 503.3349 522.6344 530.8345 539.7604 543.5101 551.5314 578.9837 590.4691 612.3400 633.2594 636.5891 639.2893 651.7096 658.3961 668.7152 696.5164 703.2121 708.0539 742.6836 751.2832 762.4547 765.2936 767.7237 771.8382 783.1650 792.4467 807.5244 810.6079 822.2550 844.2767 857.6517 858.7249 864.0222 891.1566 892.9698 895.0236 927.7555 949.1264 973.2844 974.4539 984.8618 987.3045 991.7400 996.5449 1003.5042 1003.9654 1019.5573 1025.3527 1028.1372 1030.2697 1034.7221 1046.7312 1064.8086 1075.7661 1088.6321 1094.4718 1100.3550 1112.7931 1155.2398 1161.8869 1170.2349 1171.1599 1171.4552 1179.4192 1182.0728 1220.1445 1233.7448 1242.5497 1251.8773 1259.0009 1283.4916 1296.5013 1306.8191 1312.3816 1323.6336 1333.7896 1335.6507 1351.8329 1369.6037 1386.6409 1426.3948 1428.9121 1436.8975 1450.0390 1464.4430 1476.1875 1478.5945 1484.3097 1502.8578 1521.3948 1524.6222 1538.2455 1542.6485 1560.8401 1584.2336 1592.5402 1620.1782 1625.8972 1640.1993 1647.0539 1651.6814 1661.6624 1662.5722 3195.0562 3198.9845 3208.1186 3211.0855 3214.4467 3215.0366 3217.3197 3223.6676 3224.7437 3228.1157 3228.5440 3229.1939 3231.0525 3232.9063 3234.6385 3240.8411 3244.9194 3258.5456 3616.3138
redmass: 5.7441 6.3131 6.2756 4.6601 5.3780 6.9649 4.8365 4.8549 5.7480 7.2405 6.0668 6.4708 6.7907 6.7580 5.9012 6.9262 4.1296 8.3167 7.1916 8.6504 10.6634 7.3805 11.2094 7.0227 9.0860 8.5609 8.5648 8.6530 9.3080 7.4955 6.3554 3.5576 2.7170 4.7776 10.1379 3.9469 4.0374 3.1500 7.4507 4.3682 4.1975 1.6026 6.9270 2.5718 7.9322 4.2322 3.8091 6.7438 7.8908 6.9019 7.8369 7.3708 6.3312 5.7133 4.3405 6.4259 3.5904 1.9378 6.4920 3.2152 1.6679 1.3229 1.7755 1.8599 5.5301 3.8779 11.3564 15.5996 2.7935 5.9055 3.2664 1.4822 1.7193 1.5286 1.2726 5.4573 1.3949 1.3414 1.3122 4.9077 1.3227 1.2878 1.2792 1.3591 1.8067 3.7143 1.3143 5.8540 1.3139 7.2807 2.2926 5.9987 2.1645 1.8576 1.6959 3.2994 1.7614 2.9953 1.5197 1.4082 1.2085 1.3135 1.0942 1.3573 1.3607 2.4012 1.2465 2.7971 1.7864 2.7214 1.7939 1.9028 3.5145 2.8492 7.9023 4.7037 3.0731 5.5446 6.2078 1.2270 3.8554 3.9742 5.0302 2.2031 4.2088 2.7796 2.2500 2.4230 2.6893 1.9256 3.7938 3.1427 9.6366 4.6456 6.7915 5.6849 5.2311 5.8679 7.4852 6.0988 5.1573 6.6633 5.7909 1.0859 1.0890 1.0871 1.0940 1.0877 1.0894 1.0880 1.0954 1.0976 1.0887 1.0915 1.0922 1.0986 1.0937 1.0968 1.0952 1.0990 1.0959 1.0828
irintensity: 1.0985 7.2963 5.8499 6.6952 6.4804 1.1971 5.3818 0.1790 0.9612 2.5648 1.7338 0.5418 4.5266 1.8607 1.3868 2.4900 11.0705 3.1420 1.1158 10.4484 7.2253 4.1281 10.6602 29.1321 9.0911 31.3526 22.7373 42.1821 24.7953 93.9681 11.8748 2.6374 0.4405 13.5690 3.0474 10.5799 6.0782 11.7533 6.4542 3.5623 1.5431 149.8546 2.7089 21.8134 1.4601 60.7818 2.5891 18.9091 31.0063 11.6859 20.8460 2.1391 0.9296 2.7969 0.2456 7.8569 6.0486 91.1305 6.4944 11.7242 191.6757 51.8498 34.8782 10.3418 9.5563 9.1963 180.5144 290.6939 2.2060 6.6785 25.5521 105.1035 22.8537 9.1066 1.8103 38.4962 0.3557 3.8706 3.4243 2.5654 1.8715 1.1828 0.4687 2.3340 0.3408 0.8755 0.0054 16.5787 0.0394 16.9386 5.2536 3.2714 20.2868 32.3909 34.2425 4.7666 0.7658 17.1893 11.1864 63.3872 12.9777 6.4540 3.5141 0.2605 12.9624 136.4232 28.4101 29.1427 42.7933 183.1548 0.9041 94.4052 268.0142 24.1844 1.0092 29.4741 13.6841 716.2708 161.2655 3.4896 149.1220 23.0104 67.7534 18.3641 97.9466 143.1116 80.9176 3.3054 478.8827 11.0751 494.5448 40.3781 1264.6201 318.1651 39.3952 55.9625 4.1168 34.8094 144.1565 71.3483 56.6043 45.8329 4.8780 8.3047 5.6247 0.0092 33.2917 4.9617 4.3204 3.7638 17.4340 37.5527 0.1576 3.2713 2.1887 22.2282 1.3891 17.9246 15.6230 11.2119 5.3972 303.1947
temp: 298.150 k
press: 1.00000 atm
elementType: 44 8 6 8 6 6 6 6 6 7 6 6 6 6 6 6 6 8 7 6 1 1 1 1 1 1 1 1 7 6 6 6 6 6 6 6 6 7 1 1 1 1 1 1 7 6 6 6 6 6 1 1 1 1 1 8
symmnumber: 1
zpe: 1090954.7 jmol-1
zpe.correction: 0.415523 hartree
zpe.thermalcorrener: 0.445401 hartree
zpe.thermalcorrenthalpy: 0.446345 hartree
zpe.thermalcorrgfe: 0.352836 hartree
zpe.sumelectzpe: -1708.687017 hartree
zpe.sumelectthermal: -1708.657138 hartree
zpe.sumelectthermalent: -1708.656194 hartree
zpe.sumelectthermalfe: -1708.749703 hartree
dipole: 2.3248 9.9517 15.0497
dipole: 18.1916
quadrupole: -90.6263 -238.8774 -208.9260
quadrupole: -4.2386 -7.8656 -4.2260
quadrupole: 88.8503 -59.4008 -29.4495 -4.2386 -7.8656 -4.2260
hfenergy: -1709.1025393 hartree
pointgroup: C01 [X(C27H19N5O4Ru1)]
dipole: -0.9257272 5.2801747 4.7420479 debye
polarizability: 742.4395835|47.5704212|752.1682701|80.7037264|-7.2147615|450.5405539 unknown
InChI: InChI=1S/C14H8N2O3.C8H6N2.C5H5N.O.Ru/c17-11-7-2-1-4-8(11)13-15-10-6-3-5-9(14(18)19)12(10)16-13;1-2-4-8-7(3-1)5-6-9-10-8;1-2-4-6-5-3-1;;/h1-7,15H;1-6H;1-5H;;/q-3;2*-1;;+5
charge 0 multiplicity 3
56 atoms
Ru 0.0188949 0.16167456 0.29839218
O  0.71549394 -3.92842366 1.21851969
C  0.95236706 -2.70554327 1.05191396
O  0.00433168 -1.90481334 0.65398793
C  2.33179515 -2.19163725 1.32495845
C  3.33744185 -3.05989626 1.77627376
C  4.6442704 -2.61714904 2.04174741
C  5.02215802 -1.28264736 1.86728332
C  4.0308212 -0.41392767 1.41549267
N  4.03208604 0.94311869 1.12810154
C  2.78509896 1.31142187 0.70969978
C  2.38989734 2.64433897 0.30621629
C  3.3853581 3.63716166 0.13375378
C  3.065874 4.94061552 -0.20963833
C  1.715946 5.28784289 -0.3914267
C  0.71961232 4.33544702 -0.24024596
C  1.01539406 2.99357006 0.10313558
O  -0.03598211 2.18083035 0.23946075
N  1.98415092 0.23433635 0.72459898
C  2.71691284 -0.85094845 1.15218815
H  3.08936577 -4.1053099 1.92257561
H  5.38137267 -3.33298458 2.39016179
H  6.03147072 -0.94223202 2.07014421
H  4.82279338 1.56581992 1.24518168
H  4.43041947 3.37048068 0.26089211
H  3.85033431 5.67819352 -0.33982294
H  1.44579282 6.3051249 -0.65930788
H  -0.32499229 4.59439216 -0.38439906
N  -2.09505182 0.15093833 0.07363022
C  -2.84251226 1.11705664 0.68265972
C  -4.21489569 1.14885987 0.57135957
C  -4.84896585 0.15747413 -0.20134515
C  -6.25064007 0.07160468 -0.4088049
C  -6.7620581 -0.93859974 -1.19424596
C  -5.90581769 -1.89994154 -1.80067479
C  -4.54277938 -1.84640634 -1.61758284
C  -3.98941971 -0.81356141 -0.81187381
N  -2.6366985 -0.7947903 -0.6540212
H  -2.28020028 1.85144119 1.24457663
H  -4.78651745 1.9261934 1.06678967
H  -6.8986531 0.80837848 0.05501594
H  -7.83277336 -1.00755749 -1.3574246
H  -6.33945844 -2.68285399 -2.41422398
H  -3.8747945 -2.57087143 -2.07138996
N  -0.3782042 0.30077217 2.50902881
C  -1.15387421 -0.62604041 3.11269991
C  -1.43973843 -0.58585294 4.47403345
C  -0.90721612 0.44895542 5.2460207
C  -0.10827759 1.40997312 4.62302289
C  0.13076487 1.30397672 3.25562145
H  -1.53913513 -1.41322262 2.4749424
H  -2.06717978 -1.35391804 4.9119088
H  -1.11089367 0.50521588 6.31034055
H  0.32654398 2.23201234 5.18026717
H  0.74301978 2.03101543 2.73483326
O  0.25148414 -0.05179187 -1.45567372
