program: Gaussian 09
title: /home/michael/molsimp_comfiles/Co_3a1_26_OH/Co_3a1_26_OH.com auto generated
version: ES64L-G09RevE.01
frameworkgroup: C1[X(C24H16CoN4O5)]
method: UTPSSh
basis: Gen
operation: Freq
keyword: #P
keyword: Geom=AllCheck
keyword: Guess=TCheck
keyword: SCRF=Check
keyword: GenChk
keyword: UTPSSh/ChkBas
keyword: Freq
title: /home/michael/molsimp_comfiles/Co_3a1_26_OH/Co_3a1_26_OH.com auto gene
converged: YES YES YES YES
polarizability: 6.34837979e+02 5.74769669e+00 6.33040793e+02 7.06720445e-01 -5.31999979e+01 3.99240751e+02
1716.lowfreq: -10.2306 -4.9941 0.0005 0.0007 0.0008 5.2016 21.5748 29.4101 34.6327
frequency: 20.6649 29.2043 34.3678 38.2699 41.9471 62.1263 81.2390 91.0804 123.4431 125.9524 138.6103 172.9608 175.0434 178.6038 182.7108 190.4189 197.1045 199.1837 232.6161 241.6903 255.7568 278.9453 285.5978 294.5965 352.0153 361.0393 366.0647 391.7679 392.6642 398.2443 406.6096 421.2740 451.4426 470.2083 470.6418 475.5711 478.3572 493.5514 501.7837 527.1494 528.6278 533.5947 543.4291 550.7884 563.8959 593.3702 636.5268 641.7215 644.5743 665.0944 685.1546 688.0578 729.4679 760.3411 764.0022 771.9310 773.8974 784.7697 790.2553 792.1159 792.6731 799.8645 830.0298 837.5240 843.7591 846.4965 856.0916 886.9721 889.8841 916.6115 936.4004 965.6986 965.9376 967.7438 973.9572 983.3185 986.7466 994.9401 1016.3509 1022.9825 1034.5731 1035.7784 1040.0032 1055.9272 1075.8565 1099.0836 1102.3177 1155.1457 1156.8962 1169.3057 1172.9017 1175.6703 1176.8644 1186.7821 1193.1584 1211.2113 1248.3775 1255.3422 1274.5884 1285.4382 1285.6583 1298.4853 1317.3020 1335.3696 1337.0481 1380.8351 1395.5045 1417.9193 1433.9725 1438.1617 1451.1526 1455.5208 1474.6329 1485.4942 1500.6319 1508.3451 1539.7503 1548.7283 1585.1853 1608.1157 1622.2283 1626.5190 1628.3717 1635.4381 1641.8500 1647.7526 1662.0181 1672.0981 3201.1854 3206.1446 3210.4261 3215.5673 3217.5791 3222.7644 3225.1816 3225.4846 3233.1340 3233.7313 3234.2470 3236.7183 3245.7399 3250.3654 3278.2676 3297.7451
redmass: 5.9457 5.0583 4.7418 6.1136 6.6727 6.8807 7.0366 13.6455 6.3304 6.4768 7.8721 5.1610 5.0346 5.0786 4.2054 10.1398 6.1156 10.5540 10.0496 10.9287 8.2596 7.6631 6.9715 9.0445 9.4755 12.3480 10.3986 4.4940 3.5173 3.3919 11.3832 6.3435 11.4198 4.7870 5.1597 2.7726 3.0784 3.6269 4.0218 6.8638 11.5151 7.1149 8.2550 9.4986 11.1934 7.3269 7.3823 6.5636 3.4751 4.1939 7.8591 7.5631 11.6113 1.2444 1.3607 3.4640 1.9864 5.5044 6.5723 3.7041 5.3416 12.9077 1.3907 6.4123 1.3992 5.3767 2.3503 1.3896 1.5076 8.3902 1.4923 4.3895 1.4235 1.3560 5.4176 1.3298 1.3699 1.3611 1.3053 1.3186 2.2922 1.3405 2.3581 4.2587 2.5983 2.3306 2.8067 1.5150 1.4896 2.0011 1.2085 1.1093 2.1041 1.3680 2.7786 1.4251 2.9525 2.1979 2.9452 1.7409 1.6721 1.8044 2.9276 7.2788 3.2925 4.0842 5.2009 1.6053 7.5504 6.1477 3.3591 2.0178 2.5033 2.4504 1.9943 3.0015 3.1164 3.1183 6.7093 6.4626 6.0023 10.9575 8.6095 8.0352 5.1065 10.0161 5.7159 6.0756 1.0867 1.0892 1.0872 1.0953 1.0894 1.0918 1.0983 1.0957 1.0987 1.0933 1.0898 1.0919 1.0932 1.0979 1.0920 1.0929
irintensity: 3.9742 4.4926 1.8944 2.9921 6.3412 7.1095 0.6718 21.3358 1.6830 3.3191 6.2034 10.3336 2.2360 6.6073 2.0489 3.4269 7.3911 5.0228 11.8275 4.6357 4.8827 14.6287 0.2847 2.6360 21.8443 62.5609 38.7316 10.4960 3.9981 1.3867 1.2997 4.5521 67.9510 18.3394 10.4231 19.8546 6.5525 15.6784 5.0514 0.0846 12.9900 0.5742 13.6569 2.1426 0.0202 12.0855 12.1386 13.6922 9.2107 0.4968 70.2560 19.1378 105.6673 24.1414 51.8328 3.2745 57.7784 13.2832 0.3534 8.2964 2.5564 41.2351 90.2250 1.2759 95.5553 4.3915 12.3697 13.0162 3.6286 41.9145 12.8751 0.7052 0.0407 0.1552 1.4884 0.1052 6.2244 5.5913 0.0142 0.0136 7.1227 0.1418 11.2098 7.2973 68.8687 45.3528 32.6187 5.8705 3.0380 96.4652 6.4182 5.0079 106.6491 4.8334 76.5820 18.3301 11.6879 11.4483 16.8228 4.1686 1.0066 16.9214 29.9864 908.4716 105.7639 4.9216 44.0360 43.3644 36.9163 84.5423 3.8568 14.7404 10.0259 5.4905 7.9674 23.5823 27.2275 16.8510 48.5763 6.4622 7.1729 2072.6633 232.3404 317.4340 20.9057 319.9772 4.3782 64.7378 1.0071 0.6625 0.1143 27.6407 3.3002 3.9804 29.4711 16.1861 21.4564 0.1923 1.8202 1.4957 0.8179 0.2046 13.6470 7.5908
temp: 298.150 k
press: 1.00000 atm
elementType: 27 8 6 8 6 6 6 6 6 6 8 8 7 1 1 1 8 7 6 6 6 6 6 6 6 6 7 1 1 1 1 1 1 7 6 6 6 6 6 6 6 6 6 1 1 1 1 1 1 1
symmnumber: 1
zpe: 951986.5 jmol-1
zpe.correction: 0.362592 hartree
zpe.thermalcorrener: 0.389776 hartree
zpe.thermalcorrenthalpy: 0.390720 hartree
zpe.thermalcorrgfe: 0.303794 hartree
zpe.sumelectzpe: -1664.176380 hartree
zpe.sumelectthermal: -1664.149197 hartree
zpe.sumelectthermalent: -1664.148253 hartree
zpe.sumelectthermalfe: -1664.235179 hartree
dipole: -3.0086 5.6391 6.3720
dipole: 9.0252
quadrupole: -73.4808 -170.1191 -235.8501
quadrupole: -1.3799 3.0725 26.3866
quadrupole: 86.3359 -10.3024 -76.0335 -1.3799 3.0725 26.3866
hfenergy: -1664.5389728 hartree
pointgroup: C01 [X(C24H16Co1N4O5)]
dipole: 1.1138985 2.3921115 -2.3759614 debye
polarizability: 634.9433283|-4.6637829|625.1117224|-3.9490299|67.7744844|407.0644728 unknown
InChI: InChI=1S/C9H7N.C8H6N2.C7H3NO4.Co.O/c1-2-4-9-7-10-6-5-8(9)3-1;1-2-4-8-7(3-1)5-6-9-10-8;9-6(10)4-2-1-3-5(8-4)7(11)12;;/h1-7H;1-6H;1-3H;;/q2*-1;-3;+5;
charge 0 multiplicity 2
50 atoms
Co 0.01432863 -0.04551489 0.56366916
O  -0.02417782 3.44098445 2.46578154
C  -0.01212342 2.49703564 1.66374419
O  0.00960857 1.23182386 2.02607877
C  -0.02036951 2.70172782 0.17038433
C  -0.04421582 3.88867749 -0.56078328
C  -0.05985181 3.79595428 -1.95874347
C  -0.05481252 2.54789378 -2.59704289
C  -0.03018881 1.40481536 -1.7993526
C  -0.02908663 -0.04526195 -2.20184311
O  -0.01080993 -0.87839058 -1.19105357
O  -0.04452345 -0.4047181 -3.38976447
N  -0.01041369 1.52904643 -0.47018236
H  -0.05236259 4.84653657 -0.05428358
H  -0.0787435 4.70160202 -2.55478432
H  -0.07086371 2.46294846 -3.67718993
O  0.04191441 -1.50081616 1.59271962
N  1.99864369 -0.11236628 0.51403104
C  2.80754547 0.90767287 0.91347661
C  4.18104791 0.80084386 0.86133919
C  4.74653398 -0.39276476 0.37870411
C  6.13955243 -0.64001458 0.26344179
C  6.57512689 -1.8509496 -0.22880974
C  5.65103811 -2.85952446 -0.6225054
C  4.29438289 -2.65282144 -0.52206267
C  3.8190164 -1.41082035 -0.01872253
N  2.47192016 -1.23895135 0.06530507
H  2.32380295 1.79990225 1.28059892
H  4.80165004 1.62793265 1.18817728
H  6.8398617 0.13204054 0.56483738
H  7.63871577 -2.04599506 -0.32056576
H  6.02818527 -3.80158263 -1.00650835
H  3.57538055 -3.40954681 -0.81679646
N  -1.96117017 -0.15048316 0.54391126
C  -2.80429478 0.90017811 0.79360178
C  -4.17041293 0.76922984 0.74019987
C  -4.75335407 -0.48215766 0.41444098
C  -6.15289842 -0.70004773 0.32978256
C  -6.63424128 -1.95184778 0.00214531
C  -5.7501159 -3.03333534 -0.2521215
C  -4.38548259 -2.85330182 -0.17593615
C  -3.86413111 -1.57391546 0.15792121
C  -2.47264831 -1.34048954 0.24241157
H  -2.35016745 1.84871191 1.04217645
H  -4.79712161 1.62984494 0.94797175
H  -6.83051452 0.12554899 0.52382577
H  -7.70514815 -2.11762608 -0.06365396
H  -6.15770609 -4.00617241 -0.50750838
H  -3.69823567 -3.6717071 -0.36778206
H  -1.76880456 -2.14390205 0.05765903
