program: Gaussian 09
title: /home/michael/molsimp_comfiles/Co_3a1_24_OH/Co_3a1_24_OH.com auto generated
version: ES64L-G09RevE.01
frameworkgroup: C1[X(C21H18CoN4O3)]
method: UTPSSh
basis: Gen
operation: Freq
keyword: #P
keyword: Geom=AllCheck
keyword: Guess=TCheck
keyword: SCRF=Check
keyword: GenChk
keyword: UTPSSh/ChkBas
keyword: Freq
title: /home/michael/molsimp_comfiles/Co_3a1_24_OH/Co_3a1_24_OH.com auto gene
converged: YES YES YES YES
polarizability: 3.96537385e+02 -2.79778819e-01 5.15353132e+02 -5.86771067e-01 1.30884599e+01 4.56378510e+02
1716.lowfreq: -9.5009 0.0007 0.0008 0.0009 9.1625 16.4322 34.4005 36.1622 41.6833
frequency: 34.2127 35.8083 41.5820 59.7326 63.5765 65.5627 71.3365 102.4837 127.9404 169.1187 173.9135 180.6514 194.1356 195.6818 204.1363 224.8895 245.8885 247.2816 273.6650 291.2080 292.5065 333.7734 355.2018 367.3478 374.1951 386.1307 397.7153 399.4181 408.6295 439.0568 452.1410 470.3043 472.6386 480.7615 515.0047 552.7564 570.1139 582.4037 645.3947 647.0666 651.5462 652.6587 656.0818 667.6181 694.2652 695.2272 704.3622 723.5924 757.5177 768.9509 771.5761 772.2229 777.0577 797.8602 845.9347 874.7602 876.5403 882.7855 919.1377 924.2409 952.4613 960.9960 961.6859 994.1330 995.9220 1003.7507 1026.0131 1027.8549 1030.4639 1033.3254 1037.0993 1037.9029 1040.9854 1047.2660 1050.0206 1061.1548 1069.9445 1092.3176 1093.3160 1107.0002 1107.7094 1110.4348 1115.1499 1147.0297 1172.3269 1172.8584 1182.2896 1193.7144 1221.6861 1231.5988 1236.7508 1301.7198 1321.3504 1326.5483 1329.8445 1330.7710 1370.7376 1380.5402 1384.9407 1388.8351 1444.5065 1481.1424 1483.9818 1486.4003 1494.0250 1520.6485 1522.1612 1530.5634 1611.5680 1621.2933 1622.0392 1623.2913 1628.4134 1645.3299 1651.1637 1653.9764 1654.5834 3221.1685 3222.2030 3230.9347 3233.0501 3234.6202 3235.3165 3239.5136 3240.1721 3241.5930 3246.2090 3249.7186 3251.6003 3252.6554 3253.6300 3254.3139 3264.8821 3266.3004 3766.8722
redmass: 4.6569 5.0555 4.6042 4.4310 6.8338 5.1853 5.6146 4.1267 5.4351 6.6108 4.4799 8.0975 6.6383 5.3067 6.6380 6.5178 6.1058 7.4390 6.5247 6.3057 5.4119 7.7354 6.9281 3.1155 1.8460 8.1943 2.6655 2.2464 7.0880 3.6634 3.8677 4.3633 4.4732 4.5336 8.6055 11.7396 4.0510 7.3758 6.7136 6.6078 6.4009 6.4574 7.1389 7.0716 1.7773 1.7358 7.7542 5.7106 2.2099 1.7665 2.8839 3.0639 2.0188 1.7521 2.4500 1.2549 1.2624 7.3787 1.3125 1.1373 1.3969 1.3173 1.3166 1.4177 1.4123 1.3791 1.3413 1.3207 1.3221 1.3351 7.5462 6.2934 6.3943 6.6560 6.9657 4.7581 3.5343 1.7102 1.7107 1.7305 2.2131 1.9357 1.7290 1.6292 1.0742 1.0731 1.1832 1.7560 1.7059 1.2027 1.2112 2.6212 8.3614 8.4177 4.6184 2.4092 2.8441 1.2788 1.3050 3.2436 2.5874 2.2722 2.2787 2.3644 2.5743 1.9540 1.9531 3.0834 5.5345 5.4374 7.4021 5.5788 11.1158 6.0597 5.9654 5.3189 5.3526 1.0886 1.0887 1.0895 1.0899 1.0910 1.0909 1.0964 1.0963 1.0910 1.0942 1.0944 1.0971 1.0960 1.0986 1.0951 1.0946 1.0947 1.0665
irintensity: 1.5770 1.0693 4.7694 4.2610 7.9888 1.6164 4.0791 2.8806 5.4257 8.2757 1.1928 4.8178 4.7149 2.2837 12.8858 1.9984 23.2052 9.7694 3.4659 7.1936 3.3853 9.4902 62.8213 83.9847 49.2710 21.7085 3.3160 18.1342 80.3333 3.6326 8.7569 6.0112 13.2525 15.6057 20.6388 103.0217 0.8078 10.3772 0.8542 8.3252 1.8491 2.1638 21.6171 25.1941 28.1107 157.9431 32.4463 43.4851 1.1440 5.3061 51.4833 73.0075 103.0721 50.2608 10.2194 0.1386 0.7982 24.0595 12.9987 138.7184 0.0031 1.1823 2.5985 0.0228 0.4148 1.6840 0.2033 0.0171 0.0230 0.0450 15.1126 16.7485 2.3930 0.6964 0.1920 12.4639 6.0328 64.7295 4.8606 0.7644 1.0739 14.3498 40.5630 6.4108 2.1478 2.7755 17.8269 48.7274 83.6831 35.0940 19.3567 138.9667 56.2802 1.7275 12.8806 89.0415 138.3409 10.4505 14.6454 63.6975 3.6675 5.0455 112.0545 7.5357 194.2976 17.4261 0.5819 10.7891 4.1070 4.5861 73.7160 5.3180 1413.5270 76.3408 5.7984 10.9318 36.0134 3.7817 3.8185 5.7937 3.0791 1.8939 1.8636 2.0947 1.6431 3.5090 0.0902 2.1767 0.6733 9.8147 4.7475 7.8834 8.7504 3.4932 43.6264
temp: 298.150 k
press: 1.00000 atm
elementType: 27 8 6 8 6 6 6 6 6 6 6 6 6 6 7 7 1 1 1 1 1 1 1 8 1 7 6 6 6 6 6 1 1 1 1 1 7 6 6 6 6 6 1 1 1 1 1
symmnumber: 1
zpe: 949772.7 jmol-1
zpe.correction: 0.361749 hartree
zpe.thermalcorrener: 0.385906 hartree
zpe.thermalcorrenthalpy: 0.386850 hartree
zpe.thermalcorrgfe: 0.308272 hartree
zpe.sumelectzpe: -1400.522834 hartree
zpe.sumelectthermal: -1400.498677 hartree
zpe.sumelectthermalent: -1400.497733 hartree
zpe.sumelectthermalfe: -1400.576311 hartree
dipole: -1.9820 16.9407 5.6979
dipole: 17.9829
quadrupole: -97.6715 -150.5952 -136.1695
quadrupole: 0.3066 5.0037 15.0187
quadrupole: 30.4739 -22.4498 -8.0241 0.3066 5.0037 15.0187
hfenergy: -1400.884583 hartree
pointgroup: C01 [X(C21H18Co1N4O3)]
dipole: 3.5745998 5.9922789 1.1706724 debye
polarizability: 464.334842|24.0229472|506.9408858|4.7337119|5.3360398|396.9932997 unknown
InChI: InChI=1S/C11H7N2O2.2C5H5N.Co.H2O/c14-11(15)10-6-3-5-9(13-10)8-4-1-2-7-12-8;2*1-2-4-6-5-3-1;;/h1-7H;2*1-5H;;1H2/q-3;2*-1;+6;/p-1
charge 1 multiplicity 1
47 atoms
Co 0.16047127 0.18114083 0.09463111
O  1.47029477 -3.57155742 0.01292481
C  1.28685636 -2.34337236 0.05264168
O  0.11210965 -1.77447911 0.00909725
C  2.43449376 -1.37406337 0.15746291
C  3.79674191 -1.64969439 0.2312401
C  4.67899461 -0.56534115 0.32872109
C  4.20251501 0.74868135 0.34909746
C  2.82108934 0.95765016 0.27008351
C  2.06309166 2.22182812 0.26715121
C  2.61263073 3.5000708 0.33838015
C  1.75725259 4.60407151 0.32573401
C  0.37995028 4.4031906 0.241858
C  -0.11344678 3.10003575 0.17122005
N  0.70685095 2.04017539 0.18367827
N  2.00407293 -0.10710016 0.17955663
H  4.15100132 -2.67338075 0.21383604
H  5.74661151 -0.7447025 0.38939854
H  4.88478372 1.58664874 0.42438394
H  3.68714558 3.62476159 0.40180525
H  2.16647897 5.6067388 0.38057133
H  -0.31399207 5.23519526 0.22971757
H  -1.17192346 2.87969774 0.10027837
O  -1.69973177 0.4768848 -0.03854332
H  -1.99286411 0.84519896 0.81099022
N  -0.02604836 0.04023413 2.05486593
C  0.68266293 0.75465538 2.95447902
C  0.50639402 0.59906227 4.32558346
C  -0.43267707 -0.32177255 4.79078518
C  -1.16519389 -1.05801752 3.85855808
C  -0.9369066 -0.8540782 2.50193218
H  1.40212522 1.4662499 2.57234358
H  1.10149402 1.19784782 5.00520864
H  -0.5905106 -0.4621997 5.85483155
H  -1.9070695 -1.78613081 4.16559326
H  -1.47846517 -1.40386158 1.74349176
N  0.17768531 0.18303918 -1.87645639
C  1.05396834 0.85709342 -2.64890073
C  1.00656556 0.80123162 -4.03839713
C  0.02674188 0.0216895 -4.65386061
C  -0.87487653 -0.67727186 -3.85006344
C  -0.7716214 -0.57427114 -2.46691228
H  1.80670949 1.45255698 -2.14906635
H  1.73167919 1.36371742 -4.61495002
H  -0.03216817 -0.04070097 -5.73533602
H  -1.65322352 -1.29893228 -4.27737229
H  -1.44887687 -1.09390421 -1.80284255
