program: Gaussian 09
title: /home/michael/molsimp_comfiles/Co_3a1_22_OH/Co_3a1_22_OH.com auto generated
version: ES64L-G09RevE.01
frameworkgroup: C1[X(C29H22CoN4O3)]
method: UTPSSh
basis: Gen
operation: Freq
keyword: #P
keyword: Geom=AllCheck
keyword: Guess=TCheck
keyword: SCRF=Check
keyword: GenChk
keyword: UTPSSh/ChkBas
keyword: Freq
title: /home/michael/molsimp_comfiles/Co_3a1_22_OH/Co_3a1_22_OH.com auto gene
converged: YES YES YES YES
polarizability: 6.47895732e+02 -7.37860257e-01 7.00174675e+02 2.05479902e+00 -4.63042465e-01 4.92232657e+02
1716.lowfreq: -18.3146 -9.0791 -3.7364 -0.0005 0.0005 0.0005 21.5268 24.3458 30.2879
frequency: 20.8720 24.1941 30.2665 35.5713 39.6830 53.5823 61.6167 78.0012 112.2268 125.3802 128.2364 134.3381 158.7223 171.8138 175.0533 182.4424 184.6820 193.8266 206.9172 215.0519 236.7318 252.6552 286.1189 288.6693 292.6961 331.9755 346.0409 355.6986 373.1397 380.6891 384.0713 395.5231 399.3272 404.5864 417.5649 441.7014 467.4007 477.6833 478.6933 479.2076 491.1840 497.5878 512.8426 525.6610 526.7100 537.8999 546.5037 554.2782 571.7710 581.6108 641.2557 641.9309 643.3836 647.0710 653.5229 666.1090 702.2352 723.5492 761.3297 763.9040 764.6821 769.8662 773.5968 774.3604 777.0567 790.4325 791.3904 797.3358 833.0693 834.4196 836.6359 836.7790 848.1823 881.3095 888.5978 890.2647 908.3159 922.3000 941.2243 941.5139 951.0320 964.3686 966.5024 969.7609 973.8468 988.7893 989.8611 1004.1507 1019.4856 1019.6256 1029.7522 1031.3683 1036.0311 1039.8605 1039.9996 1058.9213 1066.0188 1070.5934 1076.8435 1102.4595 1110.6932 1142.8679 1156.9037 1157.6410 1176.2192 1177.2245 1178.4624 1189.9171 1202.4649 1205.9734 1213.2138 1251.0903 1252.7920 1283.6369 1284.0805 1296.0684 1297.7882 1298.6525 1320.6821 1321.5779 1364.1031 1375.8575 1380.6166 1386.3448 1412.5184 1415.3781 1433.1282 1433.3393 1442.1491 1474.7135 1476.3471 1483.2562 1492.3881 1496.8200 1498.4187 1527.3625 1545.6419 1547.2721 1606.7074 1608.0545 1610.1119 1621.5742 1625.4145 1641.9092 1642.5323 1643.3735 1649.8336 1671.8159 1672.4851 3201.9067 3203.1874 3206.3287 3208.5123 3216.2157 3217.8602 3222.2597 3225.3363 3226.3276 3226.8674 3229.2768 3234.2360 3237.5217 3241.6971 3242.5931 3246.4722 3248.0146 3250.6764 3251.7931 3269.7612 3272.3698 3768.7485
redmass: 5.8954 5.5483 4.8315 5.1819 4.9799 5.5039 7.3275 6.0275 4.4288 5.8641 5.9689 6.7331 6.5784 5.0243 6.1721 3.9386 4.1051 6.7096 6.5910 7.6353 7.3909 5.8722 6.0960 6.5877 4.9336 7.7587 8.1805 6.5346 7.6766 1.9937 2.2473 3.0844 6.2982 2.1626 7.4875 3.6249 4.3245 2.7208 2.9189 4.0570 3.5749 3.8669 8.7840 6.8166 6.8389 9.1323 7.8980 9.0070 4.0631 7.4566 6.4105 6.6613 3.5557 3.5307 6.8490 7.1374 7.8145 5.8331 2.0041 1.2971 1.2698 9.1458 3.5533 3.6068 1.8641 4.7293 4.7385 1.9193 1.3863 3.9087 1.7172 4.6753 2.4258 7.3341 1.3896 1.3885 1.1395 1.3217 1.4883 1.4758 1.4018 5.1657 5.1112 1.3260 1.3142 1.3692 1.3690 1.3798 1.3027 1.3030 1.3349 1.3372 7.4186 2.3653 2.3749 4.0848 3.4603 2.6544 2.6063 2.7619 1.7218 1.6725 1.4955 1.5045 1.1116 1.1116 1.1289 1.6487 1.3621 1.3922 1.8113 2.1739 2.1901 1.6329 1.6466 1.8311 1.9092 2.4300 2.2613 4.2243 3.2032 3.7054 3.9746 4.6601 1.7015 1.6378 7.2626 7.4694 2.6356 2.5310 2.5163 2.2887 2.7230 2.0132 2.0183 3.2441 3.1940 3.1994 6.3514 6.4260 5.6313 7.4342 11.1173 5.2962 5.2083 5.9244 6.4387 6.0662 6.0757 1.0868 1.0866 1.0893 1.0892 1.0951 1.0953 1.0916 1.0917 1.0982 1.0983 1.0892 1.0896 1.0913 1.0959 1.0919 1.0935 1.0919 1.0990 1.0973 1.0931 1.0934 1.0664
irintensity: 3.3925 1.6047 0.3863 0.7196 0.5884 8.8204 4.1963 1.2437 7.9605 2.8610 1.3023 0.2231 1.0473 4.2563 16.7070 2.0365 3.1080 7.5826 1.4382 12.5714 4.3373 10.4775 11.2483 4.5771 0.2138 32.8852 58.0637 34.9952 10.5282 60.8625 56.8971 1.6873 29.5771 42.4561 50.9104 9.6834 10.9392 17.9223 18.7104 22.4742 1.0821 12.6960 29.5384 0.3906 0.2060 56.3889 8.4512 29.5294 0.5298 11.5316 11.7681 14.4703 0.9209 14.5052 24.9324 21.8681 28.8779 46.7155 0.2944 24.0694 40.5830 44.2442 1.9982 3.6423 113.1156 0.6123 1.1127 40.5784 83.7538 21.5298 65.3214 11.6150 9.7310 25.5724 14.3172 13.8267 139.3235 0.3185 22.5892 7.5813 0.0020 0.6524 1.9084 0.1359 0.1514 5.8465 6.6361 1.9580 0.0100 0.0182 0.0522 0.2096 16.6036 11.4914 10.0186 11.5080 7.2223 93.2266 20.9498 8.9813 38.2613 6.2937 3.4093 3.5273 5.3961 5.4485 12.6636 41.9927 30.8395 13.7475 83.8792 16.9718 10.0912 5.6321 3.0606 20.6614 35.9210 120.4193 119.0929 25.7169 123.4819 1.0940 10.3038 100.0179 31.1503 46.0711 54.1535 27.7825 2.6897 12.7195 0.7114 28.9666 167.9541 8.5003 5.0888 11.5577 6.2831 22.0185 5.6020 4.4436 7.8444 67.6742 1380.7815 59.6241 22.5306 38.0781 5.4535 56.9052 64.8817 1.3234 0.7575 0.5754 1.1376 27.4839 26.3101 3.9074 5.0116 30.7916 28.1397 6.0650 3.3911 3.5353 0.9802 3.1639 0.7936 2.8751 6.7997 0.2621 14.5513 13.2872 42.1604
temp: 298.150 k
press: 1.00000 atm
elementType: 27 8 6 8 6 6 6 6 6 6 6 6 6 6 7 7 1 1 1 1 1 1 1 8 1 7 6 6 6 6 6 6 6 6 6 1 1 1 1 1 1 1 7 6 6 6 6 6 6 6 6 6 1 1 1 1 1 1 1
symmnumber: 1
zpe: 1193627.7 jmol-1
zpe.correction: 0.454629 hartree
zpe.thermalcorrener: 0.484263 hartree
zpe.thermalcorrenthalpy: 0.485207 hartree
zpe.thermalcorrgfe: 0.393795 hartree
zpe.sumelectzpe: -1707.751095 hartree
zpe.sumelectthermal: -1707.721461 hartree
zpe.sumelectthermalent: -1707.720517 hartree
zpe.sumelectthermalfe: -1707.811928 hartree
dipole: 1.9268 17.6158 -3.1487
dipole: 17.9984
quadrupole: -111.0520 -143.9538 -200.1143
quadrupole: -1.8629 -4.3689 17.1232
quadrupole: 40.6547 7.7529 -48.4076 -1.8629 -4.3689 17.1232
hfenergy: -1708.2057233 hartree
pointgroup: C01 [X(C29H22Co1N4O3)]
dipole: 3.4769584 -6.1063374 0.8750575 debye
polarizability: 577.8104382|-102.3200151|614.6290067|-1.9091229|-2.1630834|647.8636196 unknown
InChI: InChI=1S/C11H7N2O2.2C9H7N.Co.H2O/c14-11(15)10-6-3-5-9(13-10)8-4-1-2-7-12-8;2*1-2-4-9-7-10-6-5-8(9)3-1;;/h1-7H;2*1-7H;;1H2/q-3;2*-1;+6;/p-1
charge 1 multiplicity 1
59 atoms
Co 0.09475639 -0.30011179 0.11512727
O  1.52216236 3.40387872 0.2222236
C  1.30208425 2.18130646 0.19834315
O  0.1091343 1.65291321 0.13051918
C  2.41863696 1.17069371 0.2455249
C  3.79045563 1.39439813 0.32099041
C  4.63537077 0.2765573 0.35220977
C  4.11439472 -1.02018603 0.30889728
C  2.72578895 -1.17606942 0.23479174
C  1.92373372 -2.41128883 0.17844112
C  2.42758126 -3.70921152 0.18863255
C  1.5333676 -4.78107269 0.13135995
C  0.16370679 -4.52849709 0.06446888
C  -0.2832615 -3.20647196 0.05631035
N  0.57440556 -2.17838725 0.11228123
N  1.94616461 -0.08066301 0.20659685
H  4.18034997 2.40465588 0.3535136
H  5.70900133 0.4164165 0.41030326
H  4.76729872 -1.88441464 0.33220725
H  3.497179 -3.87521962 0.24116715
H  1.90707296 -5.7988944 0.13885718
H  -0.55895206 -5.33438122 0.01864052
H  -1.33349209 -2.94510466 0.00244134
O  -1.77670477 -0.50446876 -0.03090318
H  -2.0874562 -0.90216601 0.79889352
N  -0.07853373 -0.25361539 2.08285234
C  0.64158635 -1.04025424 2.94726698
C  0.49083616 -0.9613183 4.309227
C  -0.43421808 -0.04548549 4.87267277
C  -0.6526419 0.09526151 6.2672339
C  -1.57543647 1.01318658 6.72785309
C  -2.31386818 1.8246181 5.82692254
C  -2.12278925 1.71133192 4.46632891
C  -1.17944179 0.77328022 3.96622273
C  -0.95262636 0.62079165 2.57916393
H  1.34152356 -1.7375269 2.50981201
H  1.08317779 -1.60677115 4.94891921
H  -0.08883615 -0.52481895 6.9572192
H  -1.74298347 1.12041938 7.7950827
H  -3.03257851 2.53745556 6.21802883
H  -2.68104561 2.32603653 3.76674524
H  -1.49792353 1.22605732 1.86452434
N  0.1134674 -0.21068621 -1.85560999
C  0.96181939 -0.92191531 -2.66591604
C  0.92388873 -0.82034398 -4.03443657
C  -0.01288814 0.04257144 -4.65905135
C  -0.12032817 0.20345259 -6.06457525
C  -1.06400953 1.06555428 -6.58665857
C  -1.93393295 1.79995101 -5.73852335
C  -1.8526666 1.66560327 -4.36885858
C  -0.8907875 0.78363117 -3.80604142
C  -0.77529848 0.6108019 -2.40751582
H  1.67035884 -1.5788457 -2.18090112
H  1.61438115 -1.40608626 -4.63175933
H  0.5440061 -0.35725027 -6.71476126
H  -1.14633023 1.18783079 -7.66223886
H  -2.66576703 2.47041763 -6.1774382
H  -2.51202834 2.22106913 -3.70880735
H  -1.4257047 1.15211613 -1.73141849
