program: Gaussian 09
title: /home/michael/molsimp_comfiles/Co_3a1_20_OH/Co_3a1_20_OH.com auto generated
version: ES64L-G09RevE.01
frameworkgroup: C1[X(C28H21CoN5O3)]
method: UTPSSh
basis: Gen
operation: Freq
keyword: #P
keyword: Geom=AllCheck
keyword: Guess=TCheck
keyword: SCRF=Check
keyword: GenChk
keyword: UTPSSh/ChkBas
keyword: Freq
title: /home/michael/molsimp_comfiles/Co_3a1_20_OH/Co_3a1_20_OH.com auto gene
converged: YES YES NO YES
polarizability: 6.52166107e+02 6.22815984e+00 7.03510437e+02 3.73579469e+00 -5.11460042e+00 4.91311140e+02
1716.lowfreq: -10.8831 -6.2835 0.0004 0.0005 0.0010 7.4734 24.3638 28.0212 34.8353
frequency: 24.3054 27.6253 34.8126 38.4110 41.9482 53.2116 64.8560 81.0793 113.0660 125.7842 128.7262 133.4509 159.9284 173.3260 178.8012 182.4544 186.2441 194.8816 206.9889 213.7257 238.1677 256.5968 288.4824 290.9847 293.4016 332.2857 342.1919 357.3133 373.7962 381.4677 389.7987 394.2251 402.1894 403.6354 425.5116 442.4075 467.9022 477.4206 478.6801 479.0124 492.9174 503.0372 514.8840 525.9411 533.4070 539.9577 545.3957 553.5416 572.3271 582.7037 636.8424 640.9789 645.7091 652.9032 666.1228 668.1584 702.1110 723.5428 762.3635 765.1396 767.1259 771.0110 773.9745 777.3443 785.3303 790.7489 792.5035 797.9003 835.0124 837.2159 846.3407 848.5114 852.1431 881.9522 890.5549 893.4954 912.6640 922.0288 940.6288 952.3487 964.9150 973.8682 974.0810 986.3034 990.1566 997.2601 1002.8486 1020.3018 1024.6273 1029.3257 1032.2588 1034.7734 1035.4928 1039.7767 1057.9893 1065.6127 1071.9652 1100.6328 1102.1197 1109.5189 1143.3030 1156.0488 1157.3903 1173.4624 1177.0071 1177.8363 1189.0505 1189.8687 1204.8307 1212.5797 1247.6279 1251.5712 1283.6148 1286.4984 1295.7451 1299.1013 1316.0528 1317.9964 1322.6197 1337.2161 1363.2101 1376.5226 1385.6522 1413.4715 1433.0833 1437.9954 1441.7080 1455.5388 1474.9339 1481.1796 1486.6277 1492.6699 1497.0456 1525.8877 1540.7257 1546.0080 1584.5275 1606.6352 1610.2055 1621.1658 1623.7228 1624.8917 1641.5315 1642.4777 1649.7417 1661.7401 1671.3472 3203.1822 3208.1325 3211.5767 3217.7029 3218.6282 3223.9623 3227.0429 3227.0570 3229.6201 3232.3305 3233.1920 3234.1735 3236.2158 3241.4614 3244.3548 3246.9409 3250.8132 3250.9515 3276.1187 3287.8832 3766.0863
redmass: 6.4582 5.7031 5.5008 4.8166 4.6006 5.6300 7.2576 6.0519 4.4991 6.0811 6.0947 6.9759 6.6080 4.7617 5.0122 5.9640 4.2625 6.4042 6.3946 7.7923 7.4356 6.2060 6.2418 6.8489 4.9982 7.3141 8.7737 7.2420 4.8900 1.4959 4.5239 3.4794 6.4355 2.3909 6.6346 3.6031 4.3132 4.1581 2.8118 3.1482 3.6212 3.9855 8.4248 6.8120 7.0765 8.7536 7.9488 9.8108 4.0624 7.5205 7.3737 6.5640 3.6206 6.9679 7.0258 4.4574 7.7849 5.7868 1.9547 1.2974 1.3813 9.1107 3.5735 1.8675 5.5129 4.7335 3.6394 1.9479 4.4663 1.4965 4.7152 2.4801 1.3996 7.3857 1.3888 1.4984 1.1368 1.3244 1.4867 1.4008 5.1477 5.1331 1.3215 1.3283 1.3678 1.3562 1.3825 1.3029 1.3157 1.3357 1.3412 2.3613 6.7894 2.3719 4.1161 3.3313 2.6324 2.8109 2.9898 1.7615 1.6617 1.5180 1.4995 1.2048 1.1124 1.1412 1.4392 1.4075 1.3788 1.9566 2.9105 2.1838 1.6396 1.7469 1.8131 2.3726 2.0390 2.7840 7.3494 2.9606 3.4049 3.8122 4.9447 1.6862 7.3210 6.4214 2.6839 1.9882 2.5378 2.2972 2.3842 2.7446 2.0025 3.3428 3.0678 3.1805 6.7038 6.3613 5.5879 7.6322 7.0208 8.4319 5.3620 6.0305 6.5982 5.6978 6.0663 1.0867 1.0893 1.0872 1.0952 1.0895 1.0918 1.0983 1.0956 1.0895 1.0899 1.0931 1.0987 1.0914 1.0954 1.0919 1.0931 1.0981 1.0987 1.0927 1.0936 1.0663
irintensity: 6.8615 0.7741 0.9586 1.4889 0.5491 9.8369 1.9478 1.3627 8.6759 1.9496 1.8039 0.2830 0.9311 2.9771 13.0729 10.5403 5.3578 6.3999 2.0090 12.9166 3.0229 4.0884 10.5373 8.0069 0.3889 30.5844 57.5308 43.0172 11.5043 118.5303 10.2901 4.0941 22.3549 49.6735 34.9709 10.6624 9.4592 7.7121 24.3525 6.9945 10.8765 3.3647 24.3403 0.3678 0.8108 45.7172 8.0257 46.3375 0.6536 11.1450 10.4115 12.4233 7.8917 21.8228 22.7387 0.1140 27.2549 45.2228 0.5690 28.3131 50.7676 41.6781 3.5590 109.2753 15.1842 0.9581 9.9029 39.5748 13.2655 71.6084 3.4663 9.5983 94.4486 25.4848 13.7004 5.0473 140.2628 0.7844 19.2626 0.0027 1.8592 1.9862 0.0478 0.1569 6.2517 4.0833 1.7150 0.0150 0.0022 0.1085 0.2595 8.6340 15.3160 10.5817 10.8120 6.3285 60.6947 5.3480 3.2513 39.5251 5.0779 8.9488 3.6119 6.2998 5.7503 12.9440 15.7458 10.8648 24.5047 86.1042 14.6914 13.2471 3.9628 2.4432 19.9299 98.5396 65.4282 73.2842 57.9183 9.6400 127.0655 5.1210 124.1043 41.5183 41.9974 85.0806 3.9655 14.5262 7.7211 45.1046 5.5879 161.7371 7.4508 12.3719 29.3839 13.4015 43.8709 5.4244 7.8159 169.1676 539.8648 793.6074 54.5161 39.6939 5.2838 4.0629 63.0263 0.8694 0.9313 0.2148 26.3050 3.9856 4.0607 30.8145 13.4299 6.0521 3.6321 1.3718 19.2913 4.6134 0.9978 3.5132 0.5895 1.7561 4.8011 16.4288 9.3144 40.8984
temp: 298.150 k
press: 1.00000 atm
elementType: 27 8 6 8 6 6 6 6 6 6 6 6 6 6 7 7 1 1 1 1 1 1 1 8 1 7 6 6 6 6 6 6 6 6 7 1 1 1 1 1 1 7 6 6 6 6 6 6 6 6 6 1 1 1 1 1 1 1
symmnumber: 1
zpe: 1160897.1 jmol-1
zpe.correction: 0.442162 hartree
zpe.thermalcorrener: 0.471613 hartree
zpe.thermalcorrenthalpy: 0.472557 hartree
zpe.thermalcorrgfe: 0.381981 hartree
zpe.sumelectzpe: -1723.769948 hartree
zpe.sumelectthermal: -1723.740498 hartree
zpe.sumelectthermalent: -1723.739554 hartree
zpe.sumelectthermalfe: -1723.830129 hartree
dipole: -1.0284 19.9806 -2.3128
dipole: 20.1403
quadrupole: -90.8693 -145.5061 -198.5427
quadrupole: -2.6738 -3.2393 15.7447
quadrupole: 54.1034 -0.5334 -53.5700 -2.6738 -3.2393 15.7447
hfenergy: -1724.2121107 hartree
pointgroup: C01 [X(C28H21Co1N5O3)]
dipole: 4.3098418 6.6392394 0.3638841 debye
polarizability: 571.8926146|103.1304601|622.7405196|-3.3681542|-5.6641102|652.3545498 unknown
InChI: InChI=1S/C11H7N2O2.C9H7N.C8H6N2.Co.H2O/c14-11(15)10-6-3-5-9(13-10)8-4-1-2-7-12-8;1-2-4-9-7-10-6-5-8(9)3-1;1-2-4-8-7(3-1)5-6-9-10-8;;/h1-7H;1-7H;1-6H;;1H2/q-3;2*-1;+6;/p-1
charge 1 multiplicity 1
58 atoms
Co 0.09456582 0.31979269 -0.0933624
O  1.44721389 -3.41657631 -0.22184865
C  1.25304399 -2.189038 -0.18836958
O  0.07330474 -1.63493574 -0.12708283
C  2.39169895 -1.20309585 -0.21547396
C  3.75831945 -1.4563441 -0.29027832
C  4.62782972 -0.3573639 -0.31308164
C  4.13468225 0.94990368 -0.26448777
C  2.74980858 1.13526173 -0.19116117
C  1.97785914 2.38906795 -0.13935278
C  2.51571563 3.67324218 -0.14563568
C  1.64958782 4.76807391 -0.09371473
C  0.27348127 4.55089037 -0.0346999
C  -0.20820616 3.24117693 -0.02936012
N  0.62209766 2.1901722 -0.08212095
N  1.94538726 0.05764079 -0.16603396
H  4.12543736 -2.47483059 -0.33064839
H  5.69825525 -0.51996512 -0.37096834
H  4.80603616 1.79992294 -0.28527245
H  3.58997451 3.80958595 -0.19090507
H  2.04922261 5.77599958 -0.0986512
H  -0.42843435 5.37513467 0.00760363
H  -1.26525821 3.00848587 0.01988909
O  -1.76775084 0.59190723 0.02140717
H  -2.04273901 1.01515843 -0.80857112
N  0.07715364 0.22072314 1.87966529
C  0.86924553 0.96989417 2.6982357
C  0.80373306 0.85448161 4.0698728
C  -0.10428229 -0.0632195 4.62769687
C  -0.27561503 -0.29148311 6.01812426
C  -1.19603629 -1.22446905 6.443815
C  -1.97950389 -1.9621223 5.51222872
C  -1.8392136 -1.76362471 4.15778202
C  -0.8950355 -0.8077416 3.69260731
N  -0.78015727 -0.6409291 2.34704892
H  1.54978877 1.66029329 2.22261729
H  1.445282 1.4648861 4.6958787
H  0.32410754 0.27311202 6.72460654
H  -1.33090263 -1.4049506 7.50536595
H  -2.69482932 -2.68945029 5.881607
H  -2.42719183 -2.31624435 3.43284748
N  -0.05460325 0.28117263 -2.06395191
C  0.68746888 1.05546663 -2.92095105
C  0.55221906 0.97564367 -4.28462716
C  -0.37786113 0.07093995 -4.85786442
C  -0.57859757 -0.07316017 -6.25476605
C  -1.50651074 -0.98141253 -6.72432811
C  -2.26831351 -1.77908164 -5.83057976
C  -2.09562422 -1.66150021 -4.46791684
C  -1.14700537 -0.73369958 -3.95879617
C  -0.93679991 -0.5797687 -2.56938732
H  1.39208752 1.74391685 -2.47697541
H  1.1617812 1.61114989 -4.91805164
H  0.00303386 0.53598386 -6.93965182
H  -1.6598605 -1.09176456 -7.79337517
H  -2.98998242 -2.48492078 -6.2288764
H  -2.67145214 -2.26562153 -3.77336652
H  -1.50098812 -1.17428896 -1.86060396
