program: Gaussian 09
title: /home/michael/molsimp_comfiles/Co_3a1_20_OH/Co_3a1_20_OH.com auto generated
version: ES64L-G09RevE.01
frameworkgroup: C1[X(C28H20CoN5O3)]
method: UTPSSh
basis: Gen
operation: Freq
keyword: #P
keyword: Geom=AllCheck
keyword: Guess=TCheck
keyword: SCRF=Check
keyword: GenChk
keyword: UTPSSh/ChkBas
keyword: Freq
title: /home/michael/molsimp_comfiles/Co_3a1_20_OH/Co_3a1_20_OH.com auto gene
converged: YES YES NO YES
polarizability: 6.63773367e+02 4.85755003e+00 6.87259453e+02 1.26620783e+01 1.13426233e+01 5.09652231e+02
1716.lowfreq: -8.1686 -6.9187 0.0004 0.0006 0.0008 4.4642 12.3103 20.6138 26.3963
frequency: 11.6711 20.0885 26.3760 31.9922 36.6002 53.5106 59.9709 78.8289 106.0441 116.8087 125.6439 132.2643 160.7110 169.4823 176.8009 178.3974 182.9607 193.0545 205.9433 221.3564 225.9649 253.3091 277.9949 287.4597 290.5148 332.1205 343.8579 359.9122 373.5701 388.9907 390.3136 395.1937 406.0359 424.2170 437.2597 464.9068 474.5034 475.5556 477.0094 491.0349 502.5151 512.6153 525.3847 532.9529 538.2519 548.3175 561.6871 571.0437 583.0834 637.3504 640.5915 642.3769 653.3539 664.5734 666.0974 702.3192 723.7880 756.5376 760.7295 763.5604 770.5476 772.0604 776.0754 784.9090 789.5540 789.8512 795.7180 827.9174 835.9438 847.2216 847.7264 853.3398 880.6525 887.3898 890.0287 916.1788 932.1515 952.1237 964.3553 965.9306 973.3662 985.7305 987.6471 997.2706 1000.9971 1017.5527 1023.0389 1027.8836 1030.2736 1033.8286 1035.6837 1039.2060 1057.9271 1063.9319 1072.7954 1101.4418 1106.2057 1111.9866 1141.7629 1155.1302 1156.5341 1172.6473 1175.9322 1178.6125 1186.8302 1191.6054 1202.7779 1211.2812 1249.7294 1251.2285 1281.8678 1285.5457 1291.8850 1296.4065 1315.5315 1318.8724 1321.3389 1339.2115 1363.3075 1378.4350 1387.0763 1410.8680 1432.4741 1438.5530 1443.2262 1455.5895 1474.2873 1482.6341 1485.9841 1492.9965 1495.6018 1527.0068 1541.5926 1545.0994 1584.7181 1606.2824 1610.3514 1621.3008 1621.5533 1627.4350 1640.8322 1643.1197 1649.7678 1660.3198 1670.4309 3202.1631 3207.3849 3212.1230 3216.6471 3218.0753 3222.8191 3225.9565 3227.1687 3229.6135 3231.6775 3233.9949 3234.0982 3237.0493 3243.1530 3245.9382 3248.1600 3250.6301 3251.7802 3268.2844 3279.9534
redmass: 5.5996 5.9482 4.3078 5.2925 5.8955 5.5225 7.7471 6.2621 4.3035 6.0929 6.7989 6.6731 6.8928 4.9239 4.1005 4.1470 8.4804 7.2868 6.6210 6.8734 9.3522 6.2137 7.7905 6.7528 5.0387 9.0609 11.6713 7.7805 8.0499 4.1666 3.7407 3.6113 6.7075 6.8081 3.6473 4.4048 2.6825 3.1484 4.2749 3.6914 3.9754 8.9252 6.8257 7.1583 8.8783 8.0741 10.9433 4.0310 7.7135 7.3508 6.6430 3.3944 7.0806 4.4160 7.0915 7.8261 5.7620 2.0432 1.2632 1.3629 8.5257 3.5643 1.8795 5.4950 4.6913 3.5402 2.0081 1.4047 6.1891 2.4476 6.0361 1.3259 7.6522 1.3745 1.5158 1.3505 1.5383 1.4028 5.0974 1.3315 5.3485 1.3211 1.3668 1.3612 1.3815 1.3056 1.3230 1.3501 1.3352 2.2883 7.2925 2.3570 3.8716 3.5160 2.5934 2.8664 3.0214 1.7438 1.6620 1.4874 1.4945 1.2005 1.1116 1.1408 1.6830 1.4156 1.3718 1.7648 2.1819 2.9382 1.6284 1.7462 1.8145 2.4940 2.0072 2.9812 6.0022 2.9565 3.2136 3.8411 4.6962 1.7249 7.2300 6.5920 2.6516 1.9941 2.5301 2.3583 2.3608 2.6837 2.0396 3.2643 3.0363 3.2224 6.7552 6.5113 5.7015 5.9330 7.2783 11.1624 5.2173 6.1692 6.3949 5.6943 6.1099 1.0867 1.0892 1.0873 1.0953 1.0896 1.0916 1.0983 1.0955 1.0892 1.0903 1.0948 1.0970 1.0917 1.0955 1.0922 1.0934 1.0987 1.0975 1.0931 1.0943
irintensity: 2.1999 4.2508 0.0895 3.8439 2.2734 8.2330 3.3214 1.3616 6.0221 1.9522 0.9885 0.3729 1.2214 1.4174 7.8067 4.2716 5.9591 5.2256 7.9661 6.6572 0.1674 7.2996 1.0114 5.8445 0.2996 11.1221 31.0500 18.2796 5.2193 6.4440 5.1325 1.8857 30.6151 31.0170 11.5196 13.7507 26.9421 7.6271 10.0292 11.0712 3.3912 16.9132 0.1719 0.9401 14.7875 13.0672 12.5531 0.2468 7.5904 10.1970 13.8919 8.1417 19.1024 2.2509 15.6942 24.8948 52.0796 0.3424 22.5190 57.4352 38.5482 1.1486 102.1281 23.0884 0.6390 9.2084 40.6635 94.2010 2.1385 12.3753 1.0790 87.7100 27.9164 13.6856 8.7328 0.0673 14.7237 0.0134 0.5773 0.4667 1.3142 0.6445 6.1869 3.3594 2.2777 0.0152 0.0109 0.1185 0.1718 6.9503 21.3453 9.9566 9.5619 7.5728 66.6836 11.9863 1.4530 37.0148 5.4849 7.9275 4.1180 5.9043 5.4717 15.3379 55.8983 1.9010 27.7292 96.9272 15.7602 9.4519 4.3520 2.6518 15.7438 142.7747 115.2659 51.3837 25.8018 10.6152 131.3750 5.6870 107.5158 42.5102 45.2272 98.8571 2.7101 13.1718 9.3398 23.2919 10.0334 180.2539 9.0276 16.1344 31.4557 12.9619 49.7229 3.4545 5.6115 48.3697 38.9517 1384.8380 35.8729 77.0235 3.3217 2.6406 61.9296 0.8108 0.7730 0.0542 26.5406 3.4838 3.7344 30.2357 12.8040 6.7209 2.9648 10.6915 11.0889 5.4787 0.1919 4.2240 1.5844 4.1189 0.9478 16.6693 7.3345
temp: 298.150 k
press: 1.00000 atm
elementType: 27 8 6 8 6 6 6 6 6 6 6 6 6 6 7 7 1 1 1 1 1 1 1 8 7 6 6 6 6 6 6 6 6 7 1 1 1 1 1 1 7 6 6 6 6 6 6 6 6 6 1 1 1 1 1 1 1
symmnumber: 1
zpe: 1129239.2 jmol-1
zpe.correction: 0.430104 hartree
zpe.thermalcorrener: 0.459411 hartree
zpe.thermalcorrenthalpy: 0.460355 hartree
zpe.thermalcorrgfe: 0.367669 hartree
zpe.sumelectzpe: -1723.111899 hartree
zpe.sumelectthermal: -1723.082592 hartree
zpe.sumelectthermalent: -1723.081648 hartree
zpe.sumelectthermalfe: -1723.174335 hartree
dipole: -3.7938 18.7690 -4.7153
dipole: 19.7206
quadrupole: -87.1438 -139.2432 -204.5490
quadrupole: 0.6808 -2.4477 13.1435
quadrupole: 56.5015 4.4022 -60.9037 0.6808 -2.4477 13.1435
hfenergy: -1723.5420031 hartree
pointgroup: C01 [X(C28H20Co1N5O3)]
dipole: -1.3741308 7.5918264 -0.8204916 debye
polarizability: 663.0481014|2.2943854|680.3803064|17.4758506|35.8139158|517.2566428 unknown
InChI: InChI=1S/C11H7N2O2.C9H7N.C8H6N2.Co.O/c14-11(15)10-6-3-5-9(13-10)8-4-1-2-7-12-8;1-2-4-9-7-10-6-5-8(9)3-1;1-2-4-8-7(3-1)5-6-9-10-8;;/h1-7H;1-7H;1-6H;;/q-3;2*-1;+5;
charge 1 multiplicity 2
57 atoms
Co -0.0342165 -0.06924325 -0.14132847
O  0.12440543 -1.84268101 3.41092561
C  0.07707053 -1.08795852 2.42602411
O  -0.00406365 -1.50245759 1.18808768
C  0.1074575 0.41217767 2.57476994
C  0.18326454 1.16810462 3.74139531
C  0.19293737 2.56428575 3.61559802
C  0.12412581 3.17574529 2.35959763
C  0.04625978 2.35770605 1.22719491
C  -0.05204296 2.72981859 -0.1962706
C  -0.10285202 4.02831 -0.69704597
C  -0.18897595 4.2161173 -2.0788049
C  -0.22085236 3.10636326 -2.92252605
C  -0.17148066 1.82849559 -2.36453314
N  -0.09044342 1.65005164 -1.03928352
N  0.04539456 1.02201734 1.38599654
H  0.23310784 0.68316739 4.70893698
H  0.25320544 3.18233751 4.50458868
H  0.12778001 4.25494034 2.26419082
H  -0.07469434 4.87219108 -0.01793322
H  -0.22919692 5.21988085 -2.48695069
H  -0.28459256 3.21454546 -3.9986494
H  -0.19673732 0.92388121 -2.96073748
O  -0.08036964 -1.10730266 -1.61516773
N  -1.99173409 -0.17713958 -0.12427503
C  -2.82637099 0.78899071 0.34671267
C  -4.19589065 0.62937905 0.31977777
C  -4.72677113 -0.56172634 -0.20615282
C  -6.11178488 -0.85763209 -0.29870938
C  -6.51398431 -2.06019543 -0.83758682
C  -5.56332968 -3.01230544 -1.30258155
C  -4.21312883 -2.75848809 -1.22722154
C  -3.77264867 -1.52417004 -0.67635202
N  -2.43283662 -1.30002448 -0.61836928
H  -2.36464108 1.68387965 0.73865025
H  -4.8401709 1.41522414 0.69827097
H  -6.83222523 -0.12876617 0.05750822
H  -7.57141537 -2.29218314 -0.91167726
H  -5.91497304 -3.94939777 -1.72120293
H  -3.47442636 -3.47160434 -1.57647013
N  1.93545973 -0.1818479 -0.24813297
C  2.7814423 0.89764335 -0.20881135
C  4.14554332 0.75891914 -0.27500596
C  4.72714408 -0.53010887 -0.38953533
C  6.12512357 -0.75908045 -0.46290865
C  6.60409817 -2.04943313 -0.57334697
C  5.71889929 -3.15834961 -0.61545003
C  4.35523912 -2.96755263 -0.54581248
C  3.83649885 -1.64945312 -0.43145215
C  2.44583562 -1.40696605 -0.35496089
H  2.32920964 1.87566395 -0.12446849
H  4.77293914 1.64304756 -0.23888574
H  6.80349201 0.08775969 -0.43066224
H  7.67404873 -2.22445833 -0.6293019
H  6.12427163 -4.16117247 -0.70267892
H  3.66713147 -3.80682133 -0.57687832
H  1.74075467 -2.22885236 -0.38254683
