program: Gaussian 09
title: /home/michael/molsimp_comfiles/Co_3a1_2_OH/Co_3a1_2_OH.com auto generated
version: ES64L-G09RevE.01
frameworkgroup: C1[X(C32H25CoN6O)]
method: UTPSSh
basis: Gen
operation: Freq
keyword: #PGeom=AllCheck
keyword: Guess=TCheck
keyword: SCRF=Check
keyword: GenChk
keyword: UTPSSh/ChkBas
keyword: Freq
title: /home/michael/molsimp_comfiles/Co_3a1_2_OH/Co_3a1_2_OH.com auto genera
converged: YES YES NO YES
polarizability: 7.11605738e+02 -5.79232979e+01 6.42746824e+02 -1.46110847e+01 -1.05903398e+01 6.93614725e+02
1716.lowfreq: -4.3124 0.0002 0.0005 0.0011 2.0425 6.6852 21.0708 24.6245 34.1412
frequency: 20.9043 24.5280 34.0310 36.9324 45.0204 54.4945 59.0762 92.6421 99.5248 105.3991 123.6051 128.9653 143.0303 150.9891 164.2511 178.5886 182.3645 187.8434 193.6192 194.7464 229.5323 241.6952 259.5499 273.4992 289.3335 314.3825 314.9794 341.9751 349.8936 363.9352 369.3460 389.3831 397.5950 404.4001 416.4074 432.2280 449.9022 460.6111 466.9565 476.4281 480.8606 482.7988 495.1716 502.8250 503.3882 526.0406 528.2206 534.4830 542.2131 546.2769 552.4923 565.6918 636.7733 641.3868 642.7623 646.8822 648.5725 651.7045 657.2030 667.3146 681.1574 731.8245 743.4257 762.3979 762.6342 764.6367 766.5694 775.1334 785.3760 787.9664 792.2675 792.8498 798.4590 834.1749 837.1809 839.2700 841.8008 845.7260 855.1276 890.1498 892.8506 919.7970 923.0061 946.0409 948.4640 968.7835 974.4898 976.2764 987.9794 989.8583 998.9045 1004.2104 1004.8169 1011.5522 1019.4247 1025.7017 1026.5436 1030.1573 1030.8992 1033.3856 1037.1004 1038.4115 1040.6981 1047.1597 1061.1627 1068.0086 1072.8856 1089.4366 1104.8363 1117.5177 1125.5184 1138.6209 1156.6776 1157.4174 1161.3643 1172.8079 1176.9098 1177.7967 1182.9019 1190.7727 1201.9668 1213.5919 1251.3884 1252.9707 1283.9267 1285.5361 1296.2549 1301.3956 1310.7215 1316.7448 1319.1094 1327.3496 1337.3533 1343.7063 1369.8596 1378.1465 1381.3620 1412.1824 1434.5561 1435.1519 1441.6566 1455.5413 1473.4401 1475.0204 1484.7996 1485.6500 1493.3051 1497.9638 1509.6660 1535.3873 1540.3236 1546.2201 1586.4467 1608.1826 1608.5722 1615.0450 1619.7379 1620.6499 1641.4399 1642.4715 1647.7586 1651.1915 1660.4675 1671.9350 3202.4102 3207.1019 3212.4223 3216.7496 3219.3822 3225.1671 3226.2200 3227.8177 3228.8576 3228.9905 3234.1821 3234.3177 3235.1656 3237.2686 3241.0161 3244.5885 3245.0577 3247.4656 3249.3442 3249.5149 3253.2268 3253.9838 3268.9931 3282.0765 3655.7538
redmass: 6.0024 5.8391 4.7299 4.2900 5.7860 5.0675 5.4620 4.9299 5.9684 4.7511 6.0031 4.2238 5.8350 6.2480 5.0302 4.3497 6.8730 3.9806 5.9969 6.3521 6.2662 4.7027 5.2599 5.0869 6.5122 7.3793 5.1124 7.4067 7.1530 6.5274 6.9258 3.7892 3.4462 4.7096 5.0786 3.4247 3.8348 5.2465 3.8655 2.8161 2.7932 3.9715 3.4107 3.2245 1.4479 5.5414 3.3927 6.3951 8.1934 8.1933 5.3970 12.5465 3.9691 7.1073 6.2896 3.8493 6.7204 6.8292 7.0003 4.4965 6.8866 6.7513 5.0521 1.9780 2.0204 1.3343 1.4234 3.6911 1.2288 5.2524 3.6586 4.5125 1.7582 2.2781 2.2309 2.1867 5.5470 5.0756 1.3796 1.4045 1.5029 1.3034 1.3347 1.4033 1.6274 3.4288 1.3177 5.3237 1.3237 1.3855 1.3601 1.3464 1.3599 1.1568 1.3047 1.3218 1.3339 1.3367 1.3407 2.2926 6.7708 7.3123 2.3734 5.2848 6.8729 2.3628 2.6409 2.0937 3.1141 1.9081 1.6609 1.6368 1.5024 1.5065 1.6320 1.1722 1.1082 1.0927 1.1027 1.4016 1.3541 1.3180 2.1945 2.9714 1.6312 1.7582 1.7453 1.7140 1.9665 2.6000 2.9494 5.2193 2.8241 3.0066 2.9566 3.7042 4.8824 1.7168 4.8639 2.7773 5.8761 2.0843 2.2038 2.5510 2.2984 2.3466 2.4922 2.0391 3.0749 3.3273 3.0769 3.1992 6.6640 6.0678 6.2308 5.7470 6.7507 5.8742 5.5224 5.2270 5.8313 6.4060 5.6916 6.0701 1.0867 1.0892 1.0874 1.0952 1.0896 1.0919 1.0980 1.0958 1.0891 1.0892 1.0900 1.0988 1.0920 1.0930 1.0915 1.0944 1.0956 1.0920 1.0933 1.0992 1.0976 1.0977 1.0936 1.0944 1.0663
irintensity: 0.6323 0.4769 2.2454 0.3099 1.4159 1.8926 5.1306 0.3897 0.6038 0.3965 1.5807 2.4594 1.1422 1.2581 0.0375 4.9230 12.8603 2.9918 1.5615 8.7492 5.5575 0.4183 1.2695 0.2502 4.1470 3.2771 1.0057 36.4055 5.1226 7.1746 14.2129 1.9425 1.6001 14.7533 11.2831 3.4232 12.6566 4.7643 9.2230 38.2453 24.2197 30.9046 25.5646 8.3661 89.6523 0.8635 5.9775 5.4545 21.2966 10.3326 0.1271 80.0504 1.3442 11.4430 13.2125 2.6999 17.6481 9.1494 23.0678 0.0048 16.3391 0.4229 22.8814 3.4922 3.1390 31.7471 41.4929 0.8990 235.0170 32.8273 13.7015 4.2029 3.1237 49.2874 43.4327 10.3471 0.9174 6.8706 84.1060 14.6744 6.8286 0.3628 0.1699 0.2999 20.0812 2.0875 0.0330 3.2276 0.3541 10.7355 4.2347 15.3930 6.3399 166.8729 0.0207 0.0013 0.2967 0.2389 0.4525 6.5147 3.4695 33.2299 11.9748 0.1067 13.5780 6.6116 65.5883 0.8679 7.9701 29.5981 11.9589 5.3305 15.0353 4.8723 4.4946 4.5852 4.9649 3.9567 8.3375 4.1018 22.7707 6.2042 15.5418 8.6739 5.6694 1.3216 12.3961 8.5771 6.1001 28.0124 23.6836 31.7931 79.1347 19.3172 2.2521 1.0945 49.9121 49.9992 30.2257 17.5026 91.3928 17.1482 8.5239 6.6874 122.9618 31.4801 1.8798 6.5950 141.0198 37.0963 32.0063 14.0567 38.9756 10.8108 4.6252 14.4280 38.9162 45.0115 49.7736 6.4142 54.6345 0.0236 4.2879 60.0769 0.7445 0.7120 0.4515 25.8010 3.0907 7.1081 26.3965 12.0237 10.3249 3.0079 5.0161 16.7340 4.3897 0.9635 0.6076 1.1671 0.4446 5.2526 0.8403 4.7156 0.2488 8.2987 14.3253 7.8615 227.7654
temp: 298.150 k
press: 1.00000 atm
elementType: 27 6 6 6 6 6 6 6 6 6 6 6 6 6 6 7 7 7 6 1 1 1 1 1 1 1 1 1 1 1 8 1 7 6 6 6 6 6 6 6 6 7 1 1 1 1 1 1 7 6 6 6 6 6 6 6 6 6 1 1 1 1 1 1 1
symmnumber: 1
zpe: 1340584.0 jmol-1
zpe.correction: 0.510601 hartree
zpe.thermalcorrener: 0.541744 hartree
zpe.thermalcorrenthalpy: 0.542688 hartree
zpe.thermalcorrgfe: 0.448727 hartree
zpe.sumelectzpe: -1782.702639 hartree
zpe.sumelectthermal: -1782.671497 hartree
zpe.sumelectthermalent: -1782.670552 hartree
zpe.sumelectthermalfe: -1782.764514 hartree
dipole: 4.9798 1.1494 11.2580
dipole: 12.3638
quadrupole: -96.7561 -136.7674 -159.0587
quadrupole: -6.9344 -4.6121 -0.6348
quadrupole: 34.1046 -5.9066 -28.1980 -6.9344 -4.6121 -0.6348
hfenergy: -1783.2132409 hartree
pointgroup: C01 [X(C32H25Co1N6O1)]
dipole: 4.3797063 -0.3876761 2.0806584 debye
polarizability: 694.8380226|5.3434529|660.9436945|-12.4546729|66.4621589|692.1855702 unknown
InChI: InChI=1S/C15H11N3.C9H7N.C8H6N2.Co.H2O/c1-3-10-16-12(6-1)14-8-5-9-15(18-14)13-7-2-4-11-17-13;1-2-4-9-7-10-6-5-8(9)3-1;1-2-4-8-7(3-1)5-6-9-10-8;;/h1-11H;1-7H;1-6H;;1H2/q-3;2*-1;+6;/p-1
charge 2 multiplicity 1
65 atoms
Co 0.17966064 0.00995682 -0.01193843
C  -0.19999602 4.20004393 0.49852294
C  1.13528035 4.58075323 0.62601834
C  2.1379024 3.6141475 0.52090966
C  1.77376217 2.28845297 0.29455304
C  2.70745358 1.16068639 0.13058598
C  4.10450378 1.18067048 0.10023333
C  4.77848012 -0.02349939 -0.12364321
C  4.07765461 -1.21956015 -0.30561257
C  2.68171215 -1.18204536 -0.25524247
C  1.72712951 -2.30018194 -0.34612424
C  2.06297401 -3.63829006 -0.54151567
C  1.04600891 -4.59555543 -0.54679476
C  -0.27450797 -4.19444977 -0.34822692
C  -0.55027122 -2.83909089 -0.16542622
N  0.42474859 -1.91986809 -0.17286228
N  2.0574849 -0.00642919 -0.04533012
N  0.45887386 1.92921955 0.17893991
C  -0.50359373 2.85618301 0.27695836
H  -1.00436579 4.92244471 0.56917564
H  1.39887433 5.61766692 0.80270554
H  3.18397498 3.88179126 0.61296603
H  4.64882665 2.10696671 0.23789824
H  5.86218597 -0.03008917 -0.15614277
H  4.60141329 -2.15269886 -0.47366507
H  3.09878809 -3.92369621 -0.68185943
H  1.28782143 -5.64182088 -0.69763765
H  -1.08835973 -4.90971352 -0.33499404
H  -1.55464101 -2.46137424 -0.01192992
H  -1.5211011 2.49903367 0.17224644
O  -1.69559231 0.00858886 -0.03922957
H  -1.94093361 0.31238117 0.85545015
N  0.1285043 -0.10149935 1.9679563
C  1.0660702 -0.74575038 2.7146216
C  0.98768345 -0.78496206 4.09162946
C  -0.08815823 -0.14225401 4.72800257
C  -0.2933049 -0.10493999 6.1319812
C  -1.39182897 0.55410913 6.63873781
C  -2.32524924 1.19874331 5.77813945
C  -2.15687143 1.18304719 4.41279957
C  -1.03062073 0.50965217 3.86577083
N  -0.88799777 0.50991373 2.51467874
H  1.87056741 -1.22772617 2.17868938
H  1.74758729 -1.30819127 4.66144999
H  0.4205778 -0.59833274 6.78321177
H  -1.55552807 0.58615672 7.71095935
H  -3.17952917 1.70774287 6.21187862
H  -2.85749246 1.66771267 3.74150121
N  0.09710059 0.1271464 -1.98524719
C  0.98004254 0.87205364 -2.72764931
C  0.91514815 0.93743395 -4.09734273
C  -0.08567482 0.21790809 -4.79951841
C  -0.22079605 0.22718992 -6.21158771
C  -1.22816823 -0.50444026 -6.80883981
C  -2.13688156 -1.2700108 -6.03201816
C  -2.03067165 -1.29812989 -4.65775822
C  -1.002097 -0.55409653 -4.01865405
C  -0.85695864 -0.55616827 -2.61250187
H  1.73888254 1.41927633 -2.18672157
H  1.63538964 1.54450105 -4.63532714
H  0.47313728 0.81277191 -6.80654894
H  -1.33169409 -0.496864 -7.88950463
H  -2.91934177 -1.83398364 -6.52933201
H  -2.72008422 -1.87879851 -4.05234768
H  -1.54640904 -1.11984322 -1.99663073
