program: Gaussian 09
title: /home/michael/molsimp_comfiles/Co_3a1_2_OH/Co_3a1_2_OH.com auto generated
version: ES64L-G09RevE.01
frameworkgroup: C1[X(C32H24CoN6O)]
method: UTPSSh
basis: Gen
operation: Freq
keyword: #P
keyword: Geom=AllCheck
keyword: Guess=TCheck
keyword: SCRF=Check
keyword: GenChk
keyword: UTPSSh/ChkBas
keyword: Freq
title: /home/michael/molsimp_comfiles/Co_3a1_2_OH/Co_3a1_2_OH.com auto genera
converged: YES YES YES YES
polarizability: 6.90978888e+02 8.90510761e+00 7.80133450e+02 -8.53739744e+00 -7.69267485e+01 5.92228458e+02
1716.lowfreq: -13.2225 -7.2591 0.0005 0.0006 0.0006 5.2613 12.5042 20.7890 26.6115
frequency: 12.0796 20.6955 26.4171 38.3752 41.8923 46.2830 56.0636 79.7170 98.0563 116.5299 121.5863 124.7940 131.9850 153.3828 165.8921 180.1905 182.9515 186.6581 192.0707 198.4464 222.3518 250.3421 254.0582 270.0374 281.1930 311.2473 315.2194 341.1340 348.6759 365.3629 377.8059 390.3957 393.5424 400.2780 423.8359 432.0212 445.1093 460.4299 464.0442 478.3960 478.5249 480.9780 492.1559 503.6885 525.2968 527.6900 533.7342 538.0291 547.3065 552.5417 565.2677 636.3320 638.7478 642.1132 643.8684 647.5174 651.9126 657.3228 666.9957 678.9608 730.5057 741.0077 758.5968 761.2991 762.6555 768.0497 774.0180 784.5625 785.5884 791.5646 792.2873 798.3057 832.6960 835.5428 838.8035 841.4512 848.0789 859.5106 889.0774 897.1649 918.5584 921.1493 940.7829 946.2067 966.8752 971.9084 973.3795 988.8484 990.6012 1001.1692 1002.2033 1003.9692 1018.2201 1025.6038 1027.4943 1029.6410 1030.8280 1034.8892 1036.8398 1038.9340 1039.6267 1045.8960 1059.1483 1067.4462 1071.2938 1089.5964 1106.0668 1119.3630 1126.5400 1143.0142 1157.0727 1157.5572 1161.6341 1174.7237 1176.5458 1180.5078 1185.5622 1195.9327 1210.2297 1221.7876 1252.9365 1253.7374 1283.6306 1288.7987 1294.7831 1302.1115 1310.3938 1319.0668 1321.0831 1327.8670 1338.8658 1341.4963 1373.1036 1377.6547 1383.3895 1415.3724 1434.1967 1436.1191 1438.6385 1457.2334 1472.9270 1474.9564 1484.1768 1489.4076 1493.9341 1499.3597 1510.3965 1538.3867 1543.2043 1547.1479 1584.3598 1606.7085 1608.5110 1615.3847 1620.3891 1620.7433 1641.4135 1642.0621 1646.8523 1650.5964 1660.9132 1670.5274 3203.2218 3208.4221 3213.1482 3217.7986 3221.3742 3223.5704 3226.3977 3226.7377 3229.2398 3230.1598 3230.3408 3232.0048 3234.7000 3235.5270 3236.4872 3239.8199 3240.8363 3247.2093 3250.2004 3251.4031 3252.3772 3255.3438 3277.9765 3287.8369
redmass: 4.8842 5.9878 5.0115 4.7828 5.7834 5.1197 5.4112 5.4055 4.3296 5.5608 4.7927 5.9234 5.2973 6.7436 4.5549 4.0153 4.0698 7.9502 6.7179 6.7492 5.7304 5.8063 6.1941 5.4493 6.2462 5.2963 7.6022 10.3444 7.2867 6.4933 7.6002 4.4328 3.4528 3.8876 6.0179 3.5345 3.8690 6.5693 4.0199 2.8880 3.1372 4.3082 3.6722 3.9336 3.6226 5.7646 7.2901 8.7431 8.0921 5.4636 13.7103 4.3995 6.2575 6.2128 3.6504 7.0308 7.0579 7.0757 4.6328 6.9187 6.7576 5.0486 2.0478 2.0897 1.3392 1.3845 3.6672 3.4562 1.4032 3.5272 4.3485 1.7298 1.3928 5.6503 2.3091 5.7376 6.1955 1.3043 1.3978 1.4887 1.3041 1.3372 1.4102 1.6105 3.6426 1.3159 5.3411 1.3826 1.3175 1.3548 1.3788 1.3702 1.3067 1.3186 1.3326 1.3338 1.3325 2.3217 7.2480 7.3534 2.3721 5.1322 6.9040 2.3745 2.6538 2.1065 3.0735 1.9063 1.6621 1.6654 1.4866 1.5140 1.6393 1.1856 1.1095 1.0998 1.1229 1.4468 1.3969 1.3494 2.9773 2.2072 1.6581 1.7357 1.7783 1.7667 1.8353 2.8048 3.0891 4.7350 2.7457 2.9003 2.8066 3.8686 4.7827 1.6965 6.6479 2.4273 6.2837 2.0031 2.1834 2.5594 2.3406 2.2735 2.4329 2.0050 3.0589 3.1912 2.9384 3.1208 6.6694 6.4732 5.9143 5.8725 6.6194 5.8506 5.1314 5.2400 5.8343 6.3506 5.6272 6.0866 1.0867 1.0892 1.0875 1.0953 1.0897 1.0919 1.0902 1.0984 1.0894 1.0960 1.0919 1.0932 1.0901 1.0914 1.0983 1.0911 1.0954 1.0947 1.0991 1.0946 1.0971 1.0970 1.0926 1.0937
irintensity: 0.2451 0.5717 0.5672 2.6566 0.7070 1.7242 5.9103 0.2835 0.0678 0.8330 2.1671 0.7984 1.1028 1.7178 0.2217 0.4795 15.4777 0.7792 2.3307 3.3887 2.1175 2.4394 2.1852 1.1721 1.2829 0.1063 2.7853 25.5484 2.7855 5.4433 16.7981 6.5926 3.9007 3.3791 13.3282 0.5732 4.1619 1.0474 0.2327 16.1448 14.6443 18.6252 13.8077 2.1251 5.6351 2.1203 2.0126 13.2220 12.1029 0.3535 18.4483 4.3474 6.1250 15.1705 4.8786 12.9564 7.1392 26.1326 0.2630 8.1673 0.0986 27.0856 0.1088 0.8492 29.6938 48.0090 0.3416 9.3336 260.5758 12.9772 8.0992 0.5973 93.0243 3.3849 6.2479 0.5273 1.0017 90.6984 13.3321 8.1494 0.0517 0.1425 0.1568 18.7050 2.1266 0.0373 1.8438 7.9559 1.2334 2.7261 1.9954 6.9129 0.0221 0.0127 0.1381 0.1496 0.0170 6.6530 8.3054 29.2384 11.8434 0.4553 13.6172 6.8165 62.0890 0.4747 0.3933 29.5193 9.2020 4.9157 4.7841 9.7678 4.9446 4.7923 5.8752 0.7716 14.0949 0.9472 21.9152 7.3480 13.1922 16.0086 3.4161 2.2269 17.3885 1.3234 10.5304 38.7316 28.8406 32.1767 73.1195 11.9917 3.2946 4.3846 51.8966 51.4446 50.8139 10.4772 102.5146 12.3130 20.4367 7.3021 107.7354 14.8128 17.8460 8.7277 145.3819 42.1601 34.3679 12.1308 50.2632 3.1830 9.6262 19.6157 31.4818 50.9629 58.6710 9.3855 49.4545 2.9774 2.9958 53.0013 0.7330 0.9212 1.0014 25.8437 4.4173 3.3822 4.1259 29.7898 6.8201 14.9488 5.1665 1.1516 5.3378 4.7557 13.9148 3.5936 0.8290 0.2867 7.8246 1.6209 1.8013 0.0492 17.4032 9.1969
temp: 298.150 k
press: 1.00000 atm
elementType: 27 6 6 6 6 6 6 6 6 6 6 6 6 6 6 7 7 7 6 1 1 1 1 1 1 1 1 1 1 1 8 7 6 6 6 6 6 6 6 6 7 1 1 1 1 1 1 7 6 6 6 6 6 6 6 6 6 1 1 1 1 1 1 1
symmnumber: 1
zpe: 1309324.2 jmol-1
zpe.correction: 0.498695 hartree
zpe.thermalcorrener: 0.529718 hartree
zpe.thermalcorrenthalpy: 0.530662 hartree
zpe.thermalcorrgfe: 0.435024 hartree
zpe.sumelectzpe: -1782.041294 hartree
zpe.sumelectthermal: -1782.010271 hartree
zpe.sumelectthermalent: -1782.009327 hartree
zpe.sumelectthermalfe: -1782.104965 hartree
dipole: 3.3457 -6.9930 9.2704
dipole: 12.0845
quadrupole: -102.1796 -118.5500 -167.5027
quadrupole: -0.0875 -0.5421 0.5580
quadrupole: 27.2312 10.8608 -38.0919 -0.0875 -0.5421 0.5580
hfenergy: -1782.5399891 hartree
pointgroup: C01 [X(C32H24Co1N6O1)]
dipole: 4.558638 -0.1385581 1.3432074 debye
polarizability: 741.593761|108.0384814|630.8949463|-12.7050981|-0.5391255|690.8520888 unknown
InChI: InChI=1S/C15H11N3.C9H7N.C8H6N2.Co.O/c1-3-10-16-12(6-1)14-8-5-9-15(18-14)13-7-2-4-11-17-13;1-2-4-9-7-10-6-5-8(9)3-1;1-2-4-8-7(3-1)5-6-9-10-8;;/h1-11H;1-7H;1-6H;;/q-3;2*-1;+5;
charge 2 multiplicity 2
64 atoms
Co 0.31438362 0.29344391 0.01612145
C  0.40833524 4.52802236 0.01030537
C  1.78104042 4.7735302 -0.01071616
C  2.67220871 3.69798104 -0.02300784
C  2.16211627 2.40192663 -0.01476399
C  2.9651979 1.16511331 -0.03132307
C  4.3547717 1.02767833 -0.06202455
C  4.88773437 -0.2653298 -0.08126539
C  4.0575137 -1.39032639 -0.06569598
C  2.67419932 -1.19141661 -0.03132786
C  1.59846564 -2.19640169 0.00274175
C  1.78165318 -3.57772052 0.01272595
C  0.65959951 -4.40807841 0.06238459
C  -0.61267368 -3.83981449 0.10479299
C  -0.7338447 -2.44959773 0.09150819
N  0.34347723 -1.65571724 0.03684171
N  2.1879466 0.06348171 -0.01818392
N  0.81248864 2.17776754 0.00664229
C  -0.04391341 3.20830888 0.02013175
H  -0.31152707 5.33771262 0.01928366
H  2.15926714 5.78968008 -0.01783915
H  3.74351617 3.86072848 -0.03993643
H  4.99967769 1.89769528 -0.07230733
H  5.96350412 -0.39771195 -0.10710062
H  4.47579206 -2.38925334 -0.07820725
H  2.78201153 -3.9930505 -0.01560894
H  0.78327869 -5.48548514 0.07046812
H  -1.50583619 -4.45150049 0.14846544
H  -1.69398023 -1.94845067 0.12571322
H  -1.09537563 2.94619149 0.03971533
O  -1.47000056 0.5400438 0.05990264
N  0.2298297 0.26459281 1.97872285
C  1.21898331 0.69474447 2.80840081
C  1.07529035 0.64623961 4.17920117
C  -0.1203538 0.13892715 4.71672225
C  -0.40125536 0.03115181 6.10364453
C  -1.61277943 -0.48235341 6.51186995
C  -2.58832292 -0.90674438 5.56585326
C  -2.34877225 -0.81774849 4.21385626
C  -1.10593821 -0.2916324 3.76724583
N  -0.89590095 -0.2167634 2.42630475
H  2.11596135 1.07534499 2.34259859
H  1.87705151 0.99692558 4.8196417
H  0.34561142 0.35591341 6.82055124
H  -1.83423191 -0.56758362 7.57073791
H  -3.53215129 -1.30514476 5.92285463
H  -3.08011242 -1.13540212 3.47865971
N  0.17978027 0.25538261 -1.96927024
C  1.15118903 0.74925836 -2.80423437
C  1.03680758 0.70048387 -4.17155111
C  -0.11058806 0.12283536 -4.77299689
C  -0.30513994 0.02999757 -6.17490768
C  -1.45590922 -0.55089087 -6.66988956
C  -2.45417582 -1.05931686 -5.79783119
C  -2.29337602 -0.98301487 -4.43067138
C  -1.11766742 -0.39036363 -3.89618547
C  -0.91023535 -0.29367523 -2.50153872
H  2.02417069 1.18682446 -2.34234715
H  1.83317492 1.10749953 -4.78540672
H  0.45702906 0.41831902 -6.84317476
H  -1.60511004 -0.62250489 -7.74279963
H  -3.34811597 -1.50994303 -6.21658713
H  -3.04905899 -1.36706272 -3.75223018
H  -1.65871179 -0.66375462 -1.81021322
