program: Gaussian 09
title: /home/michael/molsimp_comfiles/Co_31a_8_OH/Co_31a_8_OH.com auto generated
version: ES64L-G09RevE.01
frameworkgroup: C1[X(C30H21CoN5O3)]
method: UTPSSh
basis: Gen
operation: Freq
keyword: #P
keyword: Geom=AllCheck
keyword: Guess=TCheck
keyword: SCRF=Check
keyword: GenChk
keyword: UTPSSh/ChkBas
keyword: Freq
title: /home/michael/molsimp_comfiles/Co_31a_8_OH/Co_31a_8_OH.com auto genera
converged: YES YES NO YES
polarizability: 7.39087033e+02 6.16803736e+00 6.36754598e+02 1.51724418e+01 -1.40930347e+02 6.61803288e+02
1716.lowfreq: -5.7546 -0.0005 0.0005 0.0007 6.5695 9.0173 15.2831 22.3269 25.6875
frequency: 14.8393 22.2900 25.6323 31.3227 33.8624 42.5932 59.5268 85.4193 102.0891 119.7558 121.4363 129.0492 149.1893 164.5261 169.8126 178.8862 182.3960 187.3793 201.2554 210.9144 233.5582 246.1642 268.4518 277.1449 295.2927 303.1433 309.3960 330.3125 349.2905 366.9454 380.4529 390.9742 393.1190 401.1205 420.5745 452.0032 473.0080 476.5883 480.3281 487.8026 494.8826 502.1985 513.4400 524.5249 525.6512 530.3562 535.5211 541.6975 544.6042 551.3289 566.4996 599.1263 614.9812 623.1077 639.1292 643.9141 649.5649 652.1938 666.1390 666.4454 686.6882 730.6602 741.0531 742.3703 755.3074 761.7156 765.4872 767.1474 775.9362 782.9237 790.5826 792.1131 829.5456 844.5237 846.6705 847.3431 849.2414 856.3937 857.8885 886.3525 892.1384 898.5479 935.8152 946.2322 950.7541 963.3761 974.3753 979.3024 983.8877 985.7105 988.4406 996.5447 1014.3633 1015.7936 1022.1172 1034.7182 1039.4969 1041.2618 1065.0860 1066.1445 1069.1713 1102.2011 1103.4778 1154.0530 1157.5890 1159.4693 1171.8199 1173.9116 1175.7018 1177.3615 1180.9972 1200.3415 1243.9018 1246.8966 1249.0361 1255.6827 1273.4640 1282.1953 1282.4169 1295.6102 1296.8655 1315.2825 1330.0475 1334.8648 1353.7624 1376.0008 1382.2660 1402.4722 1411.0704 1432.5148 1434.9918 1445.0478 1449.3701 1467.2860 1473.6897 1485.3765 1490.4792 1497.1024 1507.4550 1526.7410 1536.5636 1543.8352 1570.4883 1584.5325 1600.7056 1611.4953 1623.3476 1634.0694 1643.0162 1653.2461 1662.0196 1673.7215 1682.5484 3188.8521 3189.9942 3192.1925 3198.9491 3203.0613 3205.7946 3209.0194 3209.4357 3213.4577 3217.4838 3217.8238 3222.4040 3224.0180 3224.5072 3225.6971 3228.1657 3232.4054 3233.0482 3248.8775 3268.2121 3626.2710
redmass: 6.1517 5.6966 5.0952 5.6053 4.5583 5.5148 5.7542 5.0201 6.5272 6.1910 6.0025 6.0231 6.6299 7.2381 7.2765 4.9125 5.9875 3.9508 6.1068 6.6396 7.1188 7.0205 8.3683 7.5329 8.6385 7.7545 7.2604 9.1913 7.3267 7.1915 5.2822 3.5286 3.5082 5.6004 7.3603 2.0551 2.6494 3.0584 1.6479 9.6359 3.7494 3.9840 7.3615 6.9079 12.7870 7.0615 3.3841 7.9132 4.0663 8.4239 8.0876 7.4052 4.9490 8.2306 7.3211 6.4278 3.7824 6.1602 4.2812 5.7720 5.0252 2.3586 5.8579 3.0889 2.5097 1.2591 1.3964 1.3285 3.4944 5.5181 4.7601 3.8246 5.9039 5.8464 1.4237 1.3599 5.9948 1.3496 1.4738 1.4056 1.5020 6.3448 1.5154 1.3351 1.2435 5.1159 5.0839 1.3218 1.2621 1.3269 1.3698 1.3633 8.0858 1.2998 1.3133 2.2877 1.8835 2.3782 2.5523 2.2674 3.7275 3.2677 3.5435 1.5492 1.4966 1.5181 1.1925 1.3258 1.1164 1.2314 1.3162 1.3871 2.6319 2.6641 2.1349 1.9542 3.1124 1.6538 1.8084 1.9849 2.0993 3.0581 2.4152 2.9707 4.2004 2.9767 3.4995 5.3803 1.7195 7.4067 4.4471 3.1560 2.3481 2.5362 2.4330 2.5238 3.9670 2.1240 2.7840 3.5644 3.1814 3.2289 5.8537 6.8711 7.8709 6.4631 5.9740 6.3264 5.1355 5.7247 5.7330 6.0826 9.4995 1.0863 1.0874 1.0889 1.0867 1.0892 1.0937 1.0928 1.0872 1.0949 1.0893 1.0908 1.0970 1.0980 1.0957 1.0917 1.0928 1.0941 1.0986 1.0949 1.0954 1.0820
irintensity: 0.6309 2.0143 8.9502 1.0930 1.2393 6.4751 2.4112 3.4008 1.9469 4.2892 1.2897 1.8155 13.6128 5.3611 4.3601 6.2890 4.3114 2.6191 0.4042 2.1432 6.4404 1.9309 11.2808 5.7940 4.9185 7.1927 4.2458 2.5395 71.1588 11.0086 25.5099 4.6274 1.9755 52.4026 2.6448 65.1314 17.0672 6.9204 115.6518 42.2785 25.2313 6.6253 58.6037 2.1423 61.7577 1.2245 0.4474 0.6412 2.4208 15.3884 25.7572 1.6724 5.2902 24.3045 4.6626 14.0934 6.5533 18.0831 0.9268 3.4689 1.1294 22.8848 21.7215 61.9307 32.8156 36.8072 98.5935 38.7266 6.2172 13.6843 0.5793 6.5415 7.1688 0.2621 9.9829 75.3807 100.9272 86.3852 11.0236 18.5988 6.1151 2.8854 7.3495 4.2873 1.1785 5.3243 3.6950 3.6297 0.2881 0.4225 1.3359 3.7852 5.4003 0.0038 0.0037 6.3535 14.8441 11.8295 66.0437 21.9881 68.5189 14.2309 38.3458 15.2281 3.9165 59.7247 9.7701 4.2925 5.0135 3.7624 14.6892 23.4015 19.3233 81.1141 25.1401 53.3718 615.2540 4.9771 1.1183 35.8655 37.5634 43.8340 82.9523 16.8651 156.6380 8.7977 0.6073 185.5455 44.5462 39.4238 70.6244 38.9850 26.5796 151.5908 5.1258 1.2557 20.3554 6.5645 426.7627 7.3713 25.5700 15.5919 102.6952 44.8948 86.2378 4.8106 25.7502 41.2126 21.9588 304.5523 2.9908 73.8976 238.0573 11.2217 14.6386 5.2483 2.2040 0.6581 39.9240 38.9777 0.2538 31.8221 2.7272 5.9388 40.9188 30.7957 17.9874 8.2290 1.8509 16.8382 21.5710 9.7283 9.1004 282.3207
temp: 298.150 k
press: 1.00000 atm
elementType: 27 8 6 6 6 6 6 6 6 7 6 6 6 6 6 8 6 7 1 1 1 1 1 1 1 1 7 6 6 6 6 6 6 6 6 7 1 1 1 1 1 1 7 6 6 6 6 6 6 6 6 6 1 1 1 1 1 1 1 8
symmnumber: 1
zpe: 1185645.5 jmol-1
zpe.correction: 0.451589 hartree
zpe.thermalcorrener: 0.482289 hartree
zpe.thermalcorrenthalpy: 0.483233 hartree
zpe.thermalcorrgfe: 0.388194 hartree
zpe.sumelectzpe: -1800.034913 hartree
zpe.sumelectthermal: -1800.004212 hartree
zpe.sumelectthermalent: -1800.003268 hartree
zpe.sumelectthermalfe: -1800.098307 hartree
dipole: 4.8549 7.1085 9.1879
dipole: 12.5904
quadrupole: -121.5615 -196.3982 -222.6164
quadrupole: -16.5398 9.2048 -10.6523
quadrupole: 58.6305 -16.2062 -42.4243 -16.5398 9.2048 -10.6523
hfenergy: -1800.4865013 hartree
pointgroup: C01 [X(C30H21Co1N5O3)]
dipole: -0.9900442 0.8805882 4.7729539 debye
polarizability: 728.0773052|-27.7631649|779.4333565|-61.6487991|-32.7939541|530.1342566 unknown
InChI: InChI=1S/C13H8N2O2.C9H7N.C8H6N2.Co.O/c16-10-6-2-1-4-8(10)13-14-9-5-3-7-11(17)12(9)15-13;1-2-4-9-7-10-6-5-8(9)3-1;1-2-4-8-7(3-1)5-6-9-10-8;;/h1-7,14H;1-7H;1-6H;;/q-3;2*-1;+5;
charge 0 multiplicity 2
60 atoms
Co -0.48663706 0.36919638 -0.23974371
O  -0.42665356 2.27623551 0.01630165
C  0.62769886 3.09151835 -0.11464195
C  0.37704816 4.46560353 0.12940008
C  1.37894296 5.42328478 0.03509321
C  2.69136249 5.06253073 -0.3132499
C  2.9737272 3.72720672 -0.5629232
C  1.9760013 2.73418664 -0.47039089
C  2.26133627 1.34550317 -0.73757877
N  3.40078388 0.7154401 -1.20765303
C  3.12961952 -0.6540277 -1.37060273
C  3.77024735 -1.81874487 -1.82816201
C  2.97328093 -2.9777028 -1.8353954
C  1.6095742 -3.05273638 -1.43798795
C  0.97206525 -1.88754618 -0.97751161
O  -0.28572934 -1.65195126 -0.55035793
C  1.80817694 -0.77427558 -0.96338701
N  1.32267746 0.42996103 -0.57335131
H  -0.63605668 4.75156817 0.39667287
H  1.13571527 6.4632374 0.23414518
H  3.47196621 5.81227847 -0.38657761
H  3.98380796 3.42857368 -0.83102671
H  4.276632 1.18416166 -1.40780762
H  4.79921354 -1.84131853 -2.16735673
H  3.4349196 -3.89709431 -2.18563634
H  1.08546128 -4.00133679 -1.50265876
N  -2.42081439 0.28632261 0.07937774
C  -3.19838428 1.31361057 -0.3632108
C  -4.565261 1.30408173 -0.18728134
C  -5.15187975 0.19974596 0.45898565
C  -6.54304201 0.05423468 0.70240509
C  -7.00721666 -1.07251671 1.34547438
C  -6.1135673 -2.09488225 1.77135077
C  -4.75936751 -1.98491691 1.55213378
C  -4.25507559 -0.83248198 0.88959221
N  -2.90951807 -0.75777649 0.69016644
H  -2.66374604 2.11919476 -0.84759633
H  -5.16872614 2.13180947 -0.54394243
H  -7.22038175 0.83672514 0.37593083
H  -8.0697784 -1.18851655 1.5331965
H  -6.51149011 -2.97000136 2.27450397
H  -4.06282304 -2.75396532 1.86867902
N  -0.181061 0.13222826 1.74971524
C  -0.81096536 0.9901755 2.61603556
C  -0.67071351 0.89548533 3.97853205
C  0.15563372 -0.11455551 4.53821092
C  0.35897152 -0.28221844 5.93268184
C  1.18125915 -1.29190494 6.39205899
C  1.83201964 -2.1725951 5.48892268
C  1.6532328 -2.03461753 4.12846931
C  0.81209637 -1.00384373 3.62977175
C  0.59552939 -0.82568199 2.24146212
H  -1.42485766 1.75393946 2.15555654
H  -1.19287277 1.59441209 4.62368127
H  -0.13780228 0.39072538 6.62490769
H  1.33534993 -1.41863388 7.45930313
H  2.47300933 -2.95746818 5.8775042
H  2.14473851 -2.7023333 3.42707559
H  1.07635841 -1.48975476 1.53186889
O  -0.82701709 0.57308306 -1.97200505
