program: Gaussian 09
title: /home/michael/molsimp_comfiles/Co_31a_6_OH/Co_31a_6_OH.com auto generated
version: ES64L-G09RevE.01
frameworkgroup: C1[X(C25H21CoN5O)]
method: UTPSSh
basis: Gen
operation: Freq
keyword: #P
keyword: Geom=AllCheck
keyword: Guess=TCheck
keyword: SCRF=Check
keyword: GenChk
keyword: UTPSSh/ChkBas
keyword: Freq
title: /home/michael/molsimp_comfiles/Co_31a_6_OH/Co_31a_6_OH.com auto genera
converged: YES YES NO YES
polarizability: 5.76199479e+02 -9.98076646e+00 6.30139942e+02 -4.73404652e+01 -5.55816028e+01 4.03368973e+02
1716.lowfreq: -18.8484 -3.5535 -0.0004 0.0005 0.0006 15.5247 24.9573 30.0860 37.0657
frequency: 20.1290 28.3972 36.6754 37.1303 43.5665 61.1270 66.7468 76.7560 84.3801 96.5626 101.6011 120.4138 125.9834 129.7420 140.2264 150.6894 155.6013 168.3891 200.3790 202.7136 211.0349 223.6200 242.6864 259.7895 269.9993 316.6672 348.0410 393.5855 398.4521 407.4816 415.9442 425.2451 434.5243 437.7428 445.1243 452.3570 519.8529 523.6922 536.0769 628.5591 630.7691 631.9097 634.8832 644.3254 649.4567 652.0607 653.6719 661.6507 706.6067 711.7842 729.5917 736.4000 744.4348 755.5242 765.1135 769.2106 782.0531 798.1576 836.8599 843.0165 890.8237 897.3960 911.5363 912.3074 934.6908 974.2312 975.8496 991.6624 995.0034 1006.1849 1006.3561 1016.6233 1021.6319 1022.9114 1028.4121 1029.4777 1029.9520 1030.2532 1031.5917 1033.3896 1034.9760 1041.5549 1045.3843 1050.6487 1076.6921 1087.8516 1090.8839 1093.6796 1098.6594 1100.5744 1118.3057 1124.7035 1138.7187 1160.2545 1172.0408 1172.8964 1180.2075 1183.0624 1211.4260 1230.5444 1236.7362 1310.0223 1315.3848 1315.9791 1323.8824 1326.6478 1332.8843 1339.5670 1365.8458 1377.5144 1383.4173 1388.9351 1438.0459 1473.9059 1478.5075 1479.3849 1485.1881 1495.1734 1513.0618 1518.0150 1523.3504 1533.1298 1609.7600 1617.9182 1618.9777 1621.9645 1623.9831 1636.3068 1638.2214 1643.2065 1645.9391 1650.8544 3216.7797 3219.9491 3219.9952 3225.6691 3226.4691 3227.9970 3228.2326 3229.6404 3232.8335 3237.0281 3237.3310 3239.3585 3241.0327 3242.4074 3244.1283 3245.2664 3246.3414 3247.9859 3249.9163 3251.2314 3253.9996
redmass: 5.6748 5.2934 5.5723 5.4851 5.5211 4.2310 3.8401 4.1450 7.5596 4.7558 5.7121 5.8538 6.1522 6.0575 5.4983 4.9829 8.1330 6.7042 8.9111 5.6734 6.9350 4.4612 15.5368 8.0295 6.2349 7.0469 6.6507 2.6894 2.7263 3.5087 3.5125 3.8497 4.1357 6.0301 4.0567 3.8177 3.1874 15.7908 5.3967 7.1387 6.7714 6.6502 4.1427 7.1025 6.8890 6.5017 6.3406 6.9799 1.8525 1.6965 6.4650 3.8778 2.1579 2.1651 1.6750 1.8516 1.2065 1.8534 2.2868 5.8715 1.2422 1.2422 1.3338 1.3212 1.4083 1.2955 1.2943 1.3912 1.3801 1.4289 1.4167 6.6389 5.9217 1.4385 6.7521 1.4253 1.5573 3.5807 1.3384 1.3500 6.5490 5.4354 5.8496 6.3097 2.4528 1.7139 1.6969 1.9601 1.7610 1.7476 1.8348 1.6206 1.6595 1.6016 1.0788 1.0808 1.1056 1.1030 1.3068 1.2228 1.2363 2.1929 1.9988 1.6261 8.2545 8.5090 7.5872 3.5710 3.2161 4.7875 1.2404 1.2132 2.2801 2.2184 2.2476 2.2248 2.0897 2.6835 2.6720 1.9548 1.9216 3.0646 5.9697 5.5892 5.3891 5.2416 6.5353 5.0904 5.5418 6.3760 5.2265 5.1332 1.0884 1.0881 1.0885 1.0928 1.0897 1.0890 1.0889 1.0899 1.0926 1.0957 1.0911 1.0925 1.0955 1.1000 1.0951 1.0975 1.0964 1.0943 1.0979 1.0975 1.0965
irintensity: 0.2331 0.1863 0.4257 1.3444 4.2549 0.7110 0.2386 1.1350 0.4587 0.9623 6.1953 2.0436 3.9125 3.4502 0.9319 1.2910 6.2686 3.5402 15.1840 4.6354 8.5559 2.0735 46.5758 16.9071 2.7706 17.1675 0.2995 0.2111 0.2688 10.6226 2.5026 9.4010 8.0597 4.0098 7.0859 0.3325 9.5251 8.1290 0.2037 1.8142 11.6503 6.0297 1.9800 9.6309 7.8693 3.8733 1.0457 14.5783 91.5457 99.6254 1.0014 18.0306 0.9499 0.6229 46.5487 29.1336 251.7728 0.8736 7.1307 1.0942 0.5149 0.1191 0.4258 0.1266 0.0128 1.4830 2.9027 1.3497 1.3603 0.3927 1.0081 3.4470 4.4369 1.1493 21.4042 2.1696 4.7120 21.2556 0.1922 0.8361 15.2748 5.5868 0.3347 1.5123 0.5319 38.5357 38.7782 1.3316 2.2072 4.4379 17.2241 8.5121 4.5910 6.1506 2.9878 2.9974 1.5259 19.9188 8.7779 27.5904 23.2618 1.3710 22.2890 9.6792 4.8689 4.1327 20.1798 115.4920 11.6262 26.3669 9.5876 4.7516 3.5670 34.6918 85.1672 60.4110 170.2943 16.3174 167.9486 17.2903 2.5238 19.6457 21.8969 21.2615 17.6130 4.4550 60.9700 32.6083 35.9701 6.0903 43.4661 61.7251 2.7812 3.9699 7.1345 1.8639 0.2755 3.2392 7.9755 5.8017 1.0990 14.5754 0.8367 2.5018 4.4950 6.1959 1.2469 1.5606 3.1606 0.9039 4.3014 2.5955 9.1746
temp: 298.150 k
press: 1.00000 atm
elementType: 27 6 6 6 6 6 6 6 6 6 6 6 6 6 6 7 7 7 6 1 1 1 1 1 1 1 1 1 1 1 7 6 6 6 6 6 1 1 1 1 1 7 6 6 6 6 6 1 1 1 1 1 8
symmnumber: 1
zpe: 1086531.1 jmol-1
zpe.correction: 0.413838 hartree
zpe.thermalcorrener: 0.441625 hartree
zpe.thermalcorrenthalpy: 0.442569 hartree
zpe.thermalcorrgfe: 0.351900 hartree
zpe.sumelectzpe: -1458.748930 hartree
zpe.sumelectthermal: -1458.721143 hartree
zpe.sumelectthermalent: -1458.720199 hartree
zpe.sumelectthermalfe: -1458.810867 hartree
dipole: -0.6944 0.3780 4.5953
dipole: 4.6628
quadrupole: -83.3907 -84.0967 -159.5321
quadrupole: 1.6104 -3.4355 -8.8513
quadrupole: 25.6158 24.9098 -50.5256 1.6104 -3.4355 -8.8513
hfenergy: -1459.1627676 hartree
pointgroup: C01 [X(C25H21Co1N5O1)]
dipole: -0.229225 0.1869299 1.810499 debye
polarizability: 587.4752835|23.2646292|625.7867412|-60.8446836|-11.318111|396.4463689 unknown
InChI: InChI=1S/C15H11N3.2C5H5N.Co.O/c1-3-10-16-12(6-1)14-8-5-9-15(18-14)13-7-2-4-11-17-13;2*1-2-4-6-5-3-1;;/h1-11H;2*1-5H;;/q-3;2*-1;+5;
charge 2 multiplicity 6
53 atoms
Co 0.34396429 -0.03434246 -0.68289358
C  -0.56599004 -4.35397419 -1.05136137
C  -1.93708839 -4.41614932 -0.80302596
C  -2.64405467 -3.23769508 -0.56302066
C  -1.95584364 -2.02244027 -0.56781232
C  -2.5944941 -0.70544404 -0.37562535
C  -3.95182343 -0.49668129 -0.10662245
C  -4.40876144 0.814695 0.02289604
C  -3.52576377 1.88383309 -0.13130415
C  -2.18167786 1.60415719 -0.39810251
C  -1.12760773 2.60966771 -0.62494105
C  -1.31974789 3.99243209 -0.58494949
C  -0.23976085 4.83296578 -0.85929048
C  1.00219328 4.27881254 -1.17047776
C  1.12699128 2.890426 -1.18884914
N  0.08785397 2.08658837 -0.91679053
N  -1.74870662 0.33319724 -0.49943856
N  -0.61742497 -1.97756389 -0.78702929
C  0.06068121 -3.10900559 -1.03813513
H  0.01594852 -5.24503948 -1.25507403
H  -2.45608508 -5.36844317 -0.80516441
H  -3.71219601 -3.26145971 -0.3843414
H  -4.63328449 -1.33175852 0.00007649
H  -5.45513528 1.00426493 0.23490675
H  -3.87733761 2.9049683 -0.05148346
H  -2.29196816 4.40644238 -0.3469234
H  -0.37180003 5.90919955 -0.83349835
H  1.86211873 4.89868364 -1.39496112
H  2.0680235 2.40418577 -1.41970708
H  1.12174834 -3.00819629 -1.23336865
N  2.38025643 -0.70669741 -0.41154014
C  2.7223417 -1.54012039 0.5937669
C  4.02642666 -1.99469702 0.76451595
C  5.01386761 -1.56463218 -0.12432405
C  4.65869195 -0.6994211 -1.16113022
C  3.33184275 -0.29727664 -1.27897374
H  1.9264917 -1.84562801 1.26376225
H  4.25415533 -2.66811257 1.58275173
H  6.03972367 -1.8997975 -0.01281007
H  5.39025328 -0.3426421 -1.87707942
H  3.00892198 0.36090738 -2.0766352
N  0.33509795 0.20260493 1.50629182
C  -0.42794909 -0.51216484 2.35834037
C  -0.39533277 -0.31730339 3.73689547
C  0.45896091 0.65423827 4.26145383
C  1.25572436 1.39233156 3.38381249
C  1.1686914 1.13365708 2.01903676
H  -1.0759965 -1.26398095 1.92202639
H  -1.02835565 -0.92056169 4.37754251
H  0.5053561 0.83024712 5.33110618
H  1.93808492 2.15459203 3.7424148
H  1.7804571 1.68009747 1.3089442
O  0.53431917 -0.14875735 -2.45241442
