program: Gaussian 09
title: /home/michael/molsimp_comfiles/Co_31a_5_OH/Co_31a_5_OH.com auto generated
version: ES64L-G09RevE.01
frameworkgroup: C1[X(C29H23CoN5O)]
method: UTPSSh
basis: Gen
operation: Freq
keyword: #P
keyword: Geom=AllCheck
keyword: Guess=TCheck
keyword: SCRF=Check
keyword: GenChk
keyword: UTPSSh/ChkBas
keyword: Freq
title: /home/michael/molsimp_comfiles/Co_31a_5_OH/Co_31a_5_OH.com auto genera
converged: YES YES YES YES
polarizability: 7.56776085e+02 7.21384001e+00 6.66217296e+02 2.11448759e+01 5.25080015e+01 4.67935033e+02
1716.lowfreq: 0.0002 0.0005 0.0007 4.2716 9.1006 11.9641 20.3899 26.3547 30.5628
frequency: 18.9325 25.4977 28.6374 31.2280 39.2861 48.1694 68.7443 77.7844 90.1166 94.9369 98.7375 103.6580 118.2810 122.7803 138.6884 141.9512 146.6596 162.2648 172.9684 196.8322 202.1545 216.4901 222.0872 231.7342 251.9146 265.8044 270.1422 318.9619 350.9177 373.0857 393.6373 396.8728 408.6279 414.3372 426.2933 436.6764 439.9465 452.7442 474.9296 487.6983 517.5067 519.7303 523.7084 535.7503 538.6517 628.9354 631.2697 633.7650 641.2381 644.8619 649.0727 650.8587 653.2930 662.1951 710.9191 730.1667 735.8164 741.9617 753.2706 766.5345 766.9431 777.6545 781.4481 788.1674 796.7571 824.8293 836.4997 843.1148 859.0737 895.0447 896.6302 904.4354 911.9291 932.0311 957.0092 959.8489 974.4596 984.5440 986.4244 992.4065 1004.1301 1006.9208 1019.1565 1020.0397 1023.7394 1025.5060 1027.4067 1028.4742 1029.6019 1032.3799 1034.9302 1041.6638 1045.8051 1051.2255 1063.2494 1079.7646 1089.1057 1097.4376 1097.6639 1120.7594 1125.8154 1141.1431 1157.4036 1162.4191 1171.3199 1177.2866 1181.5198 1187.1805 1200.9079 1213.9273 1233.5847 1250.7950 1284.4378 1299.2790 1311.0815 1319.8664 1323.6132 1324.2011 1333.8025 1341.1704 1367.2328 1376.5678 1381.8270 1387.1267 1415.4971 1431.2109 1438.0277 1473.9828 1475.9740 1477.5371 1487.1287 1494.5117 1496.1292 1516.2291 1523.0174 1536.4624 1542.5833 1605.9214 1610.7185 1618.5797 1621.9061 1624.6845 1637.1055 1638.3354 1638.4729 1644.0664 1651.0174 1667.2278 3203.8743 3209.6890 3218.6610 3218.8194 3219.9494 3220.7655 3226.1157 3226.6366 3226.8634 3227.3778 3230.6923 3231.0512 3232.8905 3238.9616 3239.4153 3243.4619 3244.0077 3244.5070 3245.9557 3249.7023 3251.4233 3252.0173 3255.7371
redmass: 5.7459 5.4169 5.5669 4.9628 5.2432 4.4090 4.0946 4.6120 7.4367 5.8389 5.0599 6.4216 5.8518 5.6431 6.0444 5.5629 5.6327 10.5552 6.1530 8.1592 4.2408 7.0049 4.1835 6.2057 15.7910 8.2280 6.2417 7.1360 6.5662 4.1773 2.7945 3.0676 3.4912 3.4995 3.8911 6.1754 4.0668 3.8529 3.1379 3.1283 3.7957 8.5428 6.8109 5.4079 8.0234 6.8954 6.4761 4.1158 6.6952 6.9019 4.2165 6.8561 6.3242 6.9559 1.7510 6.6728 3.6934 2.1822 2.2424 1.2134 1.7710 3.8176 1.2176 4.7221 1.8146 6.1146 2.3080 5.8394 1.3089 1.4089 1.2426 1.3360 1.3282 1.4126 1.5929 3.7164 1.2980 1.3907 1.3345 1.3839 1.3438 1.4230 6.6300 1.3246 2.1088 2.5477 6.9588 1.3453 1.3297 1.3201 7.1427 2.4138 5.6838 6.3593 2.5990 2.5241 1.6969 1.8595 1.7943 1.8208 1.6351 1.6551 1.5114 1.6265 1.0806 1.1086 1.1253 1.1238 1.4094 1.2763 1.2351 2.1740 1.6413 1.8685 2.4677 2.2432 6.9186 1.7034 6.8712 2.7514 3.1889 5.0245 3.7877 1.2258 1.6334 7.3721 2.2808 2.2289 2.4552 2.2399 2.0607 2.2336 2.4249 2.5780 1.9288 2.9699 3.1747 6.1188 5.9052 5.6369 5.2195 6.5271 5.0648 5.3694 5.0130 6.4135 5.1392 5.8812 1.0866 1.0891 1.0879 1.0951 1.0924 1.0900 1.0892 1.0877 1.0985 1.0888 1.0903 1.0929 1.0919 1.0913 1.0947 1.0955 1.0997 1.0959 1.0945 1.0980 1.0943 1.0978 1.0956
irintensity: 0.4169 0.1730 0.2026 0.2927 2.1882 0.7293 0.3669 2.3008 3.7732 1.8574 3.2040 4.7007 2.7459 2.0652 0.8918 2.7921 0.2454 5.9280 0.9172 13.8820 1.5641 13.3828 0.6288 0.6297 59.8263 15.5807 3.1724 22.0678 0.4663 1.7936 0.2071 1.3185 12.4679 0.9462 10.3307 1.4382 6.0684 0.2740 6.9874 32.4005 14.1617 6.8745 0.2248 0.2337 8.5218 8.9844 7.6062 1.0335 13.1285 14.2786 5.0662 14.1242 1.9960 14.4593 95.2945 0.6730 19.8625 0.6871 0.1201 39.4034 35.2421 5.9418 249.5083 1.5501 1.9829 9.3268 7.0093 0.1378 68.8631 19.5496 0.1866 0.5730 1.5719 0.0800 11.8709 6.4406 2.0404 1.0399 4.2026 3.3383 1.7208 0.7430 2.3213 0.0337 3.8203 4.8011 25.5557 0.6926 0.1742 0.0196 20.0447 13.5510 0.3667 5.3975 77.1871 0.1928 40.1755 0.9639 2.0809 16.2738 9.8252 3.5752 2.9734 5.8112 3.1171 5.3273 3.5095 24.4821 22.0805 10.4308 24.5795 11.9103 4.6849 22.6082 0.6169 43.4921 3.1829 6.7588 17.1286 97.2682 19.1309 28.6543 4.7720 4.9405 41.6822 94.2470 3.0208 40.9671 6.8607 79.7848 172.4534 4.0722 53.9269 162.7883 2.9518 15.3073 18.3077 8.8823 20.1867 33.5781 4.3795 62.6946 32.2101 31.9377 25.6364 10.3088 66.4777 87.5118 0.4977 1.3708 2.5305 29.1722 2.5937 1.4069 6.5669 2.9752 34.7354 6.9469 5.4943 1.3560 0.9805 5.5273 17.0440 0.7002 4.5729 4.4368 2.3441 2.8192 0.2236 10.4656 0.9112
temp: 298.150 k
press: 1.00000 atm
elementType: 27 6 6 6 6 6 6 6 6 6 6 6 6 6 6 7 7 7 6 1 1 1 1 1 1 1 1 1 1 1 7 6 6 6 6 6 6 6 6 6 1 1 1 1 1 1 1 7 6 6 6 6 6 1 1 1 1 1 8
symmnumber: 1
zpe: 1210126.4 jmol-1
zpe.correction: 0.460913 hartree
zpe.thermalcorrener: 0.491199 hartree
zpe.thermalcorrenthalpy: 0.492144 hartree
zpe.thermalcorrgfe: 0.396025 hartree
zpe.sumelectzpe: -1612.362430 hartree
zpe.sumelectthermal: -1612.332143 hartree
zpe.sumelectthermalent: -1612.331199 hartree
zpe.sumelectthermalfe: -1612.427318 hartree
dipole: 4.8332 0.0403 4.9141
dipole: 6.8928
quadrupole: -80.4660 -106.8452 -178.8213
quadrupole: 2.8770 8.2256 7.1688
quadrupole: 41.5781 15.1990 -56.7771 2.8770 8.2256 7.1688
hfenergy: -1612.8233429 hartree
pointgroup: C01 [X(C29H23Co1N5O1)]
dipole: 1.9068619 0.1362964 1.9233574 debye
polarizability: 756.7951338|9.0549306|671.5879472|19.5100654|41.1612402|462.5453333 unknown
InChI: InChI=1S/C15H11N3.C9H7N.C5H5N.Co.O/c1-3-10-16-12(6-1)14-8-5-9-15(18-14)13-7-2-4-11-17-13;1-2-4-9-7-10-6-5-8(9)3-1;1-2-4-6-5-3-1;;/h1-11H;1-7H;1-5H;;/q-3;-1;;+4;
charge 2 multiplicity 6
59 atoms
Co 0.32905126 0.0023022 -0.70989943
C  -0.03451125 4.39657028 -1.08045101
C  1.26617229 4.8534919 -0.86550672
C  2.28675879 3.93439171 -0.61943988
C  1.97857612 2.57204841 -0.59297642
C  2.95687292 1.49326288 -0.35427938
C  4.31828455 1.68370581 -0.09555288
C  5.12172873 0.56038816 0.09832129
C  4.56971967 -0.71718051 0.015994
C  3.20133109 -0.83724937 -0.24988157
C  2.48247854 -2.11475803 -0.41120046
C  3.07914808 -3.37006231 -0.27046077
C  2.30920904 -4.51438223 -0.47784516
C  0.96499088 -4.38005122 -0.82321515
C  0.43158327 -3.09784299 -0.94561368
N  1.17210574 -1.99701107 -0.74073937
N  2.43069849 0.25428682 -0.41105882
N  0.71033065 2.14397378 -0.80257271
C  -0.27382624 3.02381883 -1.04487883
H  -0.85263153 5.07984014 -1.27495319
H  1.48897439 5.91460487 -0.89143005
H  3.30230959 4.27290352 -0.45501268
H  4.74322963 2.6784477 -0.04741045
H  6.17954468 0.68074102 0.3041132
H  5.19074186 -1.59431893 0.14700274
H  4.12628415 -3.45308972 -0.00641155
H  2.75754326 -5.49632885 -0.37320152
H  0.3321411 -5.24228143 -0.99684118
H  -0.60869489 -2.94566336 -1.20655201
H  -1.26365077 2.61214559 -1.20778996
N  -1.80061803 -0.3368647 -0.71290623
C  -2.40601757 -1.01637507 -1.74252529
C  -3.77042673 -1.13392613 -1.83883377
C  -4.60645552 -0.52392609 -0.86613502
C  -6.02257561 -0.59341599 -0.89527081
C  -6.76205093 0.03507112 0.08765578
C  -6.12844937 0.7544361 1.13423492
C  -4.75324843 0.83936779 1.19021005
C  -3.96957672 0.20175442 0.19133887
C  -2.55626689 0.25367257 0.20958896
H  -1.74263438 -1.45300534 -2.47899185
H  -4.20647943 -1.68486362 -2.66548743
H  -6.50990932 -1.14270178 -1.69471226
H  -7.84603365 -0.01890637 0.06348381
H  -6.73556361 1.23898535 1.89200224
H  -4.25515244 1.38530926 1.98573356
H  -2.04364666 0.79189881 1.00075258
N  0.25052403 -0.19526552 1.49277912
C  -0.26745666 -1.31464203 2.0430803
C  -0.3010828 -1.52841826 3.41801445
C  0.21293141 -0.54551027 4.26632971
C  0.73972209 0.61807307 3.70321881
C  0.74039943 0.75381309 2.3174884
H  -0.66551824 -2.05365163 1.35588961
H  -0.72466136 -2.44736978 3.80701782
H  0.20080082 -0.68276788 5.34257856
H  1.14543466 1.41243731 4.31934623
H  1.13912642 1.64673905 1.84990284
O  0.29311739 0.0322399 -2.49183237
