program: Gaussian 09
title: /home/michael/molsimp_comfiles/Co_31a_4_OH/Co_31a_4_OH.com auto generated
version: ES64L-G09RevE.01
frameworkgroup: C1[X(C33H25CoN5O)]
method: UTPSSh
basis: Gen
operation: Freq
keyword: #P
keyword: Geom=AllCheck
keyword: Guess=TCheck
keyword: SCRF=Check
keyword: GenChk
keyword: UTPSSh/ChkBas
keyword: Freq
title: /home/michael/molsimp_comfiles/Co_31a_4_OH/Co_31a_4_OH.com auto genera
converged: YES YES NO YES
polarizability: 8.12809681e+02 2.77940487e+01 6.04491765e+02 7.75577571e+01 -3.34493572e+01 6.49932649e+02
1716.lowfreq: -14.8144 0.0005 0.0007 0.0010 2.6320 10.6358 19.2780 24.0526 27.3426
frequency: 19.1062 23.4828 27.0404 39.6929 48.4425 53.1306 57.6715 89.0724 99.5769 116.0654 119.4709 128.2593 129.4193 143.6112 150.6734 169.5829 176.5920 189.2506 196.6255 213.6938 221.7804 248.2702 259.0855 264.0312 269.1578 293.8332 307.1085 325.7359 352.4961 357.2953 380.7307 392.0885 398.5486 403.8732 420.7453 430.7703 440.1954 460.2828 464.7168 475.8997 477.6743 480.3875 493.9459 497.2613 522.6542 525.1296 527.0295 535.5749 539.7688 552.0197 555.6409 629.5094 641.4676 642.5240 649.1444 649.5568 651.1697 655.0077 656.6994 681.7428 732.4973 736.5703 745.0752 759.7187 766.7434 767.2043 776.4189 777.4159 783.8383 790.7019 791.8919 796.0883 829.6318 832.8783 833.9821 844.6567 846.2279 851.9501 894.0848 894.6728 912.0681 916.3043 927.4784 949.8798 955.4640 964.1976 967.0634 982.0184 986.2144 993.6474 993.9319 997.5874 998.5880 1020.1693 1021.0380 1023.5400 1031.5452 1033.4082 1034.5264 1037.3072 1039.6710 1040.5645 1050.6865 1059.5628 1061.3008 1064.5892 1085.1298 1100.5160 1122.8603 1129.4206 1146.5286 1156.6939 1157.1990 1166.5557 1176.2693 1176.3757 1184.9908 1188.5787 1199.2221 1206.5424 1219.3152 1250.2373 1252.5835 1281.6970 1283.1244 1291.3511 1301.9344 1314.3583 1322.1258 1323.7323 1330.9589 1343.4491 1372.9090 1375.6048 1378.9426 1383.3987 1409.8417 1417.8992 1432.0887 1432.5011 1440.5853 1473.3438 1473.5751 1479.0763 1489.1194 1494.1977 1496.9021 1500.1083 1518.3776 1542.2188 1543.4897 1545.3313 1604.9436 1608.7816 1612.9318 1617.9938 1625.1187 1640.0562 1641.9387 1646.3216 1649.7445 1652.7720 1670.1047 1671.0202 3202.3046 3203.3318 3207.4048 3209.1473 3216.8109 3217.6426 3217.9171 3222.9624 3224.2018 3225.9395 3226.8935 3231.7411 3232.9789 3234.1264 3236.9840 3240.6473 3245.3412 3248.1554 3251.6116 3254.0591 3255.9392 3257.4514 3263.3026 3267.0124 3268.3581
redmass: 6.0873 5.1441 5.6382 4.9140 5.1451 5.2263 4.1373 4.4935 5.2689 4.7283 5.7587 5.5287 6.8521 5.8991 5.4348 6.4978 5.8972 5.0496 4.5231 3.8581 6.2847 5.9452 5.6467 5.6419 5.7113 7.4074 6.3273 6.7300 7.0371 6.3266 5.2705 3.9401 3.7181 3.5803 10.5248 3.6215 3.6014 4.3478 5.7535 4.2060 2.8699 2.8098 3.6880 3.7816 3.8465 6.6681 5.4172 10.0426 7.9502 5.9034 9.1671 3.7848 6.6677 6.6287 7.0516 6.8055 3.8105 4.4070 5.8619 6.8174 5.6895 4.0276 2.3037 2.4031 1.2277 1.2294 3.6454 3.8129 1.2224 4.5374 4.7424 1.6763 6.3510 2.4206 5.7608 5.8202 1.3483 1.3321 1.3878 1.4181 1.3597 1.3278 1.4320 1.4535 1.8493 5.1332 2.7149 1.3035 1.3189 1.3816 1.3758 1.3741 1.3551 1.3058 1.3042 1.3400 1.3395 1.4294 5.5641 7.7416 2.4080 2.3917 6.9103 3.0837 2.9779 4.2170 2.5057 1.9777 1.9251 1.6756 1.6642 1.5024 1.5029 1.5582 1.1080 1.1094 1.1161 1.1104 1.3625 1.3913 1.3408 2.1234 2.2028 1.6090 1.6451 1.7888 1.8841 2.5302 2.7738 2.5459 2.8426 1.9019 3.5780 3.5334 2.7954 4.9013 1.7984 1.6464 6.8946 6.5606 2.2723 2.6092 2.5553 2.2108 2.1539 2.0729 2.4689 2.0010 3.0089 3.1919 3.0923 3.2505 6.4340 6.0488 5.6375 5.5277 6.9594 5.1917 4.9928 5.5748 5.7125 5.9023 6.0978 5.9383 1.0867 1.0867 1.0893 1.0890 1.0952 1.0940 1.0946 1.0917 1.0915 1.0982 1.0984 1.0894 1.0895 1.0915 1.0900 1.0930 1.0920 1.0972 1.0932 1.0947 1.0972 1.0977 1.0939 1.0943 1.0931
irintensity: 0.1043 0.1792 0.1301 0.6114 1.5931 5.1968 0.4026 2.4893 1.2727 4.4620 1.7319 4.0106 5.4585 3.4123 2.2603 2.0623 6.7580 0.7623 2.4933 1.3185 3.4198 0.1825 1.1225 0.9543 0.1150 0.8113 2.1101 4.7610 1.6169 14.7116 10.4194 2.5082 2.6817 3.0092 13.2224 3.9894 4.4032 0.0798 0.4268 2.2434 17.4916 21.9183 18.1264 17.2515 11.1542 1.0164 2.7140 35.4231 0.3666 4.9197 19.2362 1.7810 19.3654 10.7852 15.4929 3.5859 15.6931 3.1993 24.9629 18.9491 4.1323 9.0769 4.4032 1.6809 18.9969 54.1022 7.9482 3.7344 247.3598 1.0277 4.3757 4.7414 3.2430 4.4462 7.7265 2.6147 83.2401 93.9850 13.2796 23.5068 1.2894 0.4203 0.1705 10.5891 20.6913 2.6835 5.5551 0.7951 7.3711 3.1028 5.1385 1.2468 3.6169 0.0642 0.1450 0.1727 0.2898 1.3815 1.8152 28.2825 9.3021 16.2586 3.7532 46.5341 111.5748 2.7616 4.4094 1.0182 29.1462 11.5284 2.8100 3.1164 5.0797 7.4302 5.9134 7.6931 0.7805 22.4266 40.5732 12.1651 6.7356 20.4974 15.5312 3.8857 2.0711 20.1110 21.1800 17.3213 22.1906 45.2740 29.2550 52.5336 3.4145 4.0716 4.2537 70.9665 40.1582 46.3320 105.7285 23.2290 9.0162 9.8996 7.2064 4.5926 167.6596 8.8509 2.5647 12.9986 144.7546 11.2788 22.1658 20.2508 2.8522 3.4766 6.6457 20.2680 50.4673 11.0209 27.9521 34.8838 45.1822 12.2927 48.2713 105.8651 0.8779 0.6944 1.5231 0.9781 24.6077 6.6095 19.8752 4.3883 5.0102 28.8003 27.4138 4.2686 4.5987 4.9365 3.6858 0.3971 0.8160 0.9206 0.3617 0.9435 0.5231 7.8482 8.2790 15.0349 9.9864
temp: 298.150 k
press: 1.00000 atm
elementType: 27 6 6 6 6 6 6 6 6 6 6 6 6 6 6 7 7 7 6 1 1 1 1 1 1 1 1 1 1 1 7 6 6 6 6 6 6 6 6 6 1 1 1 1 1 1 1 7 6 6 6 6 6 6 6 6 6 1 1 1 1 1 1 1 8
symmnumber: 1
zpe: 1342514.3 jmol-1
zpe.correction: 0.511337 hartree
zpe.thermalcorrener: 0.542485 hartree
zpe.thermalcorrenthalpy: 0.543430 hartree
zpe.thermalcorrgfe: 0.448367 hartree
zpe.sumelectzpe: -1766.014737 hartree
zpe.sumelectthermal: -1765.983588 hartree
zpe.sumelectthermalent: -1765.982644 hartree
zpe.sumelectthermalfe: -1766.077707 hartree
dipole: -6.2276 0.1341 1.0684
dipole: 6.3200
quadrupole: -109.0003 -166.8768 -133.4552
quadrupole: 25.7885 16.7786 -15.0297
quadrupole: 27.4438 -30.4327 2.9889 25.7885 16.7786 -15.0297
hfenergy: -1766.5260737 hartree
pointgroup: C01 [X(C33H25Co1N5O1)]
dipole: 1.9709352 -0.0484791 1.5151154 debye
polarizability: 773.1536712|-69.5532073|692.0661932|70.2179198|-52.9891952|602.0142303 unknown
InChI: InChI=1S/C15H11N3.2C9H7N.Co.O/c1-3-10-16-12(6-1)14-8-5-9-15(18-14)13-7-2-4-11-17-13;2*1-2-4-9-7-10-6-5-8(9)3-1;;/h1-11H;2*1-7H;;/q-3;2*-1;+5;
charge 2 multiplicity 2
65 atoms
Co -0.00678106 -0.0702436 0.23971746
C  -0.32705323 4.20318928 0.37883853
C  1.00979483 4.56426535 0.53245827
C  1.98150545 3.56459046 0.58182903
C  1.58845022 2.23169328 0.4777588
C  2.50707906 1.08785327 0.462347
C  3.90334344 1.10307148 0.5171963
C  4.58488817 -0.11207616 0.41896174
C  3.88814705 -1.31161778 0.25652854
C  2.4924324 -1.26815972 0.2134904
C  1.55619667 -2.38544256 0.03981403
C  1.92937522 -3.71482548 -0.14589402
C  0.93628871 -4.68178143 -0.30774729
C  -0.40066715 -4.29146601 -0.28200945
C  -0.71229534 -2.94521318 -0.09298578
N  0.23932785 -2.01366456 0.07378383
N  1.86042075 -0.08591093 0.33868407
N  0.27325629 1.88634838 0.34089923
C  -0.65836554 2.85175337 0.28910756
H  -1.11549198 4.94453417 0.33079613
H  1.29677196 5.60695591 0.61007026
H  3.02987653 3.81253144 0.69487052
H  4.44312848 2.03594005 0.62331004
H  5.66820402 -0.12298075 0.4578275
H  4.41508229 -2.2528189 0.16318986
H  2.9780025 -3.98652732 -0.1679699
H  1.20768768 -5.72104366 -0.45515054
H  -1.20469851 -5.00633678 -0.40903978
H  -1.74033762 -2.60918659 -0.07918438
H  -1.68835465 2.53685721 0.18123534
N  -1.99071211 -0.08265433 0.06717743
C  -2.80123138 -0.68651707 1.00258843
C  -4.16787828 -0.72034355 0.87751287
C  -4.79826274 -0.11764388 -0.24223914
C  -6.20165909 -0.10501309 -0.4461259
C  -6.72574587 0.50199133 -1.57061437
C  -5.88225889 1.1165963 -2.53274731
C  -4.51407652 1.11893443 -2.36255027
C  -3.94981294 0.50171158 -1.21382101
C  -2.55255225 0.48084904 -1.00144944
H  -2.30162117 -1.15514637 1.84005425
H  -4.75973706 -1.21505752 1.64022481
H  -6.84876929 -0.5755591 0.28744898
H  -7.80005184 0.51131029 -1.72622552
H  -6.32359057 1.58568347 -3.40608896
H  -3.85678463 1.58465019 -3.09053314
H  -1.87561871 0.92625541 -1.72228586
N  -0.12488479 -0.11213018 2.27386135
C  -0.88567289 0.82533333 2.93410972
C  -0.95652871 0.89281048 4.30289952
C  -0.23109873 -0.03011855 5.10042702
C  -0.24128318 -0.02953515 6.51859677
C  0.49597971 -0.97095733 7.20965334
C  1.26696787 -1.94600017 6.52423148
C  1.29547233 -1.97201925 5.14617772
C  0.54777879 -1.01289966 4.41176934
C  0.55639683 -0.99623322 2.9977822
H  -1.44453473 1.51460453 2.31623499
H  -1.57261822 1.65467046 4.76847121
H  -0.83125185 0.71483216 7.04413683
H  0.48867759 -0.96990368 8.29522906
H  1.83579284 -2.67304291 7.09466947
H  1.88157587 -2.71177789 4.60936836
H  1.14543205 -1.73847264 2.47253487
O  0.1429561 0.02021128 -1.5399044
