program: Gaussian 09
title: /home/michael/molsimp_comfiles/Co_31a_23_OH/Co_31a_23_OH.com auto generated
version: ES64L-G09RevE.01
frameworkgroup: C1[X(C25H20CoN4O3)]
method: UTPSSh
basis: Gen
operation: Freq
keyword: #P
keyword: Geom=AllCheck
keyword: Guess=TCheck
keyword: SCRF=Check
keyword: GenChk
keyword: UTPSSh/ChkBas
keyword: Freq
title: /home/michael/molsimp_comfiles/Co_31a_23_OH/Co_31a_23_OH.com auto gene
converged: YES YES YES YES
polarizability: 1.78484092e+03 3.02756981e+01 5.81100143e+02 2.37640537e+02 -1.90988565e+01 4.47418087e+02
1716.lowfreq: -16.0663 -0.0003 0.0004 0.0006 3.7333 9.2202 23.2549 36.7638 41.0638
frequency: 21.9397 36.4003 41.0360 45.1083 52.9466 75.8647 78.0184 110.8105 121.0150 125.3668 132.3316 155.2191 174.8221 184.2606 188.5522 198.5177 210.4642 218.0046 227.2329 233.9081 265.4497 275.7773 286.2468 297.9741 318.0657 344.1231 368.9137 383.3105 390.3952 400.7158 405.6012 427.3140 429.3301 446.1736 458.4412 465.3585 467.1020 474.9535 508.8666 514.8572 522.5452 544.3293 570.3662 584.1037 607.1974 627.9284 644.7504 652.3476 654.2401 669.6247 701.6308 704.7012 720.6892 733.8277 758.7679 762.9061 769.0713 771.5625 773.9169 789.3536 796.7861 829.4979 841.8301 845.0230 880.6091 883.3158 896.7988 912.5373 920.0091 951.5201 961.9570 965.6367 968.6400 979.1713 999.1215 1004.9251 1009.8507 1026.7335 1030.1307 1032.1125 1032.6885 1034.3769 1038.8465 1047.4929 1052.6538 1063.5891 1074.5438 1077.8393 1093.0222 1106.8639 1115.5471 1116.7797 1130.7508 1148.6901 1173.4215 1180.8265 1182.5508 1188.8790 1195.0082 1211.6334 1242.3723 1247.8106 1277.3578 1297.9777 1303.6894 1322.1248 1327.3696 1334.7336 1338.1932 1366.9993 1388.9114 1399.3212 1407.4120 1423.9502 1446.4179 1460.0298 1481.9658 1491.7114 1497.3166 1500.9636 1533.3872 1536.6686 1555.0973 1561.2651 1566.5055 1604.8758 1614.2966 1623.2322 1624.6884 1640.2572 1646.5981 1652.7893 1654.6612 3225.2903 3229.8499 3231.1995 3234.7167 3234.9534 3238.6048 3240.8678 3241.9307 3242.6087 3243.1913 3243.5442 3246.4046 3247.5632 3248.4306 3253.1266 3254.3793 3262.1942 3273.5430 3277.4770 3725.8651
redmass: 6.0835 5.4010 5.6566 4.2453 5.2451 4.1123 7.9654 5.9250 6.0255 4.4913 5.9758 5.1546 5.9142 4.8126 4.3634 2.3058 3.1253 5.5880 2.9442 5.7085 4.4057 6.2092 6.4692 6.2569 8.4694 8.7637 6.5244 3.7796 4.0605 2.9273 7.0811 2.7745 8.0437 3.8518 4.3161 4.3262 4.0258 4.3513 7.0410 10.6846 8.2203 7.8425 4.2374 6.4370 3.0907 6.8381 6.9130 6.7113 6.6417 7.1246 1.7888 7.6097 5.9714 2.2828 2.1246 1.4517 1.7595 5.4417 2.4534 4.7897 1.8286 1.9260 2.3380 2.2640 1.3129 5.9433 1.4225 1.1430 1.3090 1.3982 3.5593 1.4834 1.4802 1.4347 1.4109 1.4816 1.3585 1.4134 1.3650 1.3375 1.3819 5.8136 7.0174 2.5914 5.8499 4.8803 2.3351 3.7697 1.7028 2.2728 1.7356 1.7682 1.6375 1.7641 1.0729 1.3510 1.1354 1.4539 1.6013 1.6538 1.6334 1.3241 1.8254 3.4599 2.0916 6.6806 8.0429 1.7092 4.3589 2.9972 4.7480 1.2274 2.5510 2.4440 2.5173 2.1884 2.2699 2.7064 2.1587 1.9807 1.9516 3.0089 4.2246 3.0777 6.0031 4.8803 5.3354 5.3345 7.0654 7.9689 8.0523 6.1482 5.0424 1.0889 1.0892 1.0894 1.0900 1.0910 1.0915 1.0941 1.0907 1.0939 1.0930 1.0970 1.0958 1.0985 1.0937 1.0970 1.0989 1.0936 1.0943 1.0921 1.0667
irintensity: 16.3156 4.9012 9.2921 3.3485 0.7996 1.5422 4.4000 9.9789 0.1242 4.5522 26.9457 91.3733 9.7623 15.6033 7.8329 28.9412 26.6342 6.3671 39.5199 57.1125 19.3823 45.2941 1.9150 60.9568 64.2968 3.3868 11.0967 4.9869 10.1395 4.4610 40.7848 32.2246 20.2230 16.1193 7.3111 12.2740 9.2074 44.3022 4.2628 995.4719 136.4797 9.0919 1.4325 9.2571 43.4876 139.9416 8.3190 7.6431 6.6366 24.5501 86.6329 11.3746 44.1495 67.6081 0.8830 50.8427 36.8085 68.6296 77.0192 12.0387 60.6741 49.8829 117.3112 11.2081 1.0956 21.5129 240.6569 657.4548 21.2552 0.4219 1.6106 60.0830 115.3095 273.4164 4.3899 30.0875 28.7528 2.2653 1.2779 1.9830 2.6168 19.6715 17.5333 188.6105 17.6887 27.0658 14.4455 10.9812 32.2341 2.5860 13.9598 7.6534 49.0138 11.8783 3.3047 311.2154 296.5120 110.7199 223.2773 185.7349 1581.9135 178.7840 456.3776 653.9311 71.6272 166.7510 15.9711 411.1818 2260.2985 198.0065 130.2272 7.5909 1160.1840 358.1034 0.6054 236.4168 56.0811 96.7855 128.3559 158.3030 19.8922 39.9933 163.2760 1724.8532 574.5215 1044.5427 24.3363 14.1014 6.2301 802.0730 691.2235 31.2944 38.6494 2.8610 1.1090 3.7590 3.8215 1.6484 1.2124 0.4512 0.5384 3.4753 0.1573 1.7441 0.1016 114.3628 1.7146 0.0084 2.6021 5.6984 44.5006 25.1181 2900.4083
temp: 298.150 k
press: 1.00000 atm
elementType: 27 8 6 8 6 6 6 6 6 6 6 6 6 6 7 7 1 1 1 1 1 1 1 7 6 6 6 6 6 6 6 6 6 1 1 1 1 1 1 1 7 6 6 6 6 6 1 1 1 1 1 8 1
symmnumber: 1
zpe: 1070021.0 jmol-1
zpe.correction: 0.407549 hartree
zpe.thermalcorrener: 0.434674 hartree
zpe.thermalcorrenthalpy: 0.435618 hartree
zpe.thermalcorrgfe: 0.349960 hartree
zpe.sumelectzpe: -1553.913065 hartree
zpe.sumelectthermal: -1553.885940 hartree
zpe.sumelectthermalent: -1553.884996 hartree
zpe.sumelectthermalfe: -1553.970654 hartree
dipole: 7.4080 15.6205 8.2365
dipole: 19.1499
quadrupole: 9.0086 -155.4755 -156.1062
quadrupole: -4.2183 -2.8556 -27.5699
quadrupole: 109.8663 -54.6178 -55.2485 -4.2183 -2.8556 -27.5699
hfenergy: -1554.3206141 hartree
pointgroup: C01 [X(C25H20Co1N4O3)]
dipole: 3.1030091 6.0123182 3.3146006 debye
polarizability: 1795.3762352|1.7119977|581.4187547|207.5722239|-20.4460444|436.5641642 unknown
InChI: InChI=1S/C11H7N2O2.C9H7N.C5H5N.Co.H2O/c14-11(15)10-6-3-5-9(13-10)8-4-1-2-7-12-8;1-2-4-9-7-10-6-5-8(9)3-1;1-2-4-6-5-3-1;;/h1-7H;1-7H;1-5H;;1H2/q-3;2*-1;+6;/p-1
charge 2 multiplicity 2
53 atoms
Co -0.45135109 -0.06866155 -0.44618944
O  -1.08453057 -3.81872611 -1.45931692
C  -1.12638853 -2.63579088 -1.09632198
O  -0.06568802 -1.92071244 -0.80317425
C  -2.421711 -1.88827876 -0.93014799
C  -3.71864173 -2.35723499 -1.10995154
C  -4.77296298 -1.45728468 -0.90660112
C  -4.52352834 -0.12729718 -0.55824971
C  -3.19493154 0.28621959 -0.40130448
C  -2.66100035 1.62458911 -0.11717719
C  -3.43089998 2.76100065 0.11908655
C  -2.7906529 3.98062 0.34315422
C  -1.39844553 4.03129204 0.32398271
C  -0.68117198 2.85894989 0.08768366
N  -1.29211873 1.68224926 -0.12631894
N  -2.21432327 -0.61568366 -0.56559378
H  -3.89148798 -3.38629825 -1.40151778
H  -5.79680315 -1.79057073 -1.03358343
H  -5.33892227 0.57307601 -0.42359397
H  -4.511802 2.68896208 0.12443916
H  -3.37440034 4.87532182 0.52833564
H  -0.85979405 4.95632313 0.4903837
H  0.40213131 2.86225617 0.07675247
N  1.47546336 0.3288339 -0.51489504
C  1.93032652 1.24075402 -1.40927619
C  3.29619938 1.39709528 -1.69376937
C  4.23531362 0.5965075 -1.03253322
C  5.64032246 0.69388454 -1.26425869
C  6.52083503 -0.14059046 -0.57489508
C  6.03456179 -1.07771248 0.34555584
C  4.65438924 -1.19551208 0.5919136
C  3.74685117 -0.36214389 -0.09088016
C  2.35305248 -0.45329935 0.12711866
H  1.18932428 1.85572163 -1.90092921
H  3.60255018 2.13436885 -2.42712031
H  6.00779433 1.4229347 -1.97853263
H  7.58716388 -0.06201067 -0.75321762
H  6.72510816 -1.72434034 0.8751096
H  4.28391665 -1.92641585 1.30310079
H  1.95683487 -1.17921865 0.82847119
N  -0.385095 -0.37510785 1.53061425
C  0.18969037 0.54965508 2.3330568
C  0.2624801 0.393918 3.7126048
C  -0.27508051 -0.75402394 4.29641581
C  -0.8641421 -1.70918737 3.46827668
C  -0.89991418 -1.48808139 2.09499713
H  0.60332015 1.4283989 1.85571119
H  0.73608622 1.16675276 4.30663668
H  -0.2340242 -0.90121906 5.37023985
H  -1.29571758 -2.61971007 3.86700975
H  -1.35218413 -2.21768949 1.43767135
O  -0.45259137 0.19263727 -2.2952726
H  -0.95409816 1.00746899 -2.47910739
