program: Gaussian 09
title: /home/michael/molsimp_comfiles/Co_31a_18_OH/Co_31a_18_OH.com auto generated
version: ES64L-G09RevE.01
frameworkgroup: C1[X(C24H18CoN4O4)]
method: UTPSSh
basis: Gen
operation: Freq
keyword: #P
keyword: Geom=AllCheck
keyword: Guess=TCheck
keyword: SCRF=Check
keyword: GenChk
keyword: UTPSSh/ChkBas
keyword: Freq
title: /home/michael/molsimp_comfiles/Co_31a_18_OH/Co_31a_18_OH.com auto gene
converged: YES YES YES YES
polarizability: 6.30430764e+02 -1.27701945e+02 8.46661913e+02 5.30316730e+01 -1.75760237e+01 3.79869576e+02
1716.lowfreq: 0.0005 0.0007 0.0007 0.7268 12.0755 14.5196 18.2382 23.7322 30.2800
frequency: 18.0942 22.8927 29.9138 34.4034 37.5904 45.9344 54.8785 68.3134 81.0162 84.8077 105.7191 114.5655 127.4318 132.9736 144.5054 149.8477 156.2959 167.6430 182.0021 186.9265 193.7756 217.8374 248.6921 250.7647 258.7983 276.8794 289.7102 317.8391 333.5463 383.4324 387.4226 390.4873 425.9632 429.3864 443.2738 453.1760 487.8926 498.6871 510.8055 518.3469 561.1434 567.9873 583.4166 600.6412 618.4023 626.5635 645.5893 651.7370 654.1091 669.5147 685.4112 704.6175 706.3417 709.4329 742.1725 747.9821 764.4460 764.7411 765.6359 784.5036 785.2067 820.5242 849.8489 871.9809 887.3063 895.8523 896.6465 931.4656 967.1765 969.4137 970.4843 976.9435 990.0538 1001.2091 1004.4264 1006.9860 1020.1421 1024.7019 1025.3610 1025.7700 1028.3189 1041.2972 1043.6516 1052.2698 1072.3376 1088.4770 1089.4082 1090.2362 1090.9615 1093.4483 1150.8132 1167.5589 1167.8150 1169.1030 1184.7546 1228.3087 1228.8966 1231.1517 1238.0231 1287.7663 1313.4115 1321.6497 1325.3593 1327.9707 1365.3311 1368.3699 1379.4302 1381.0259 1396.0700 1411.3112 1427.3897 1436.5341 1468.4659 1475.4627 1477.3468 1491.9229 1516.0026 1517.7658 1519.3430 1530.3056 1538.3330 1567.5946 1616.8093 1620.9690 1622.0993 1623.1376 1646.4332 1648.4236 1655.0569 3210.1750 3211.9229 3214.5556 3215.7846 3216.5062 3216.9548 3221.7800 3222.0381 3223.3550 3227.8580 3229.8715 3230.6926 3231.4611 3235.8337 3236.7416 3237.1554 3238.5311 3628.1908
redmass: 6.6059 5.7458 6.3525 5.3841 3.8244 7.3886 3.9327 4.4740 6.2453 7.5536 6.9935 6.1394 5.6998 7.6837 6.8328 7.2514 8.9808 7.1156 7.3483 7.1351 8.1219 13.1640 9.1760 11.8210 12.3003 4.7003 9.9695 7.0653 5.7531 10.4018 2.6583 2.6544 3.8669 3.9160 3.7148 8.8498 3.3367 4.2026 2.1068 2.2768 8.0958 3.7708 6.1647 6.9784 6.9501 6.8930 5.8828 6.3122 6.3296 6.9263 3.1542 9.5250 1.8156 1.6476 3.4798 7.2078 1.8656 1.8538 1.8738 8.9167 1.8496 2.6720 6.1443 1.5527 6.2743 1.2464 1.2448 1.3931 1.3083 1.3078 1.4106 7.6804 1.3098 1.4396 1.4378 1.3277 7.4877 5.8747 1.3069 1.3063 7.5389 5.4016 5.4510 2.4267 2.0190 1.7024 1.6989 3.0658 1.8170 1.7448 1.4157 1.2696 1.0836 1.0854 1.3321 1.3154 1.9856 1.2912 1.6926 3.2053 2.6630 8.3140 8.5275 4.1894 4.6294 6.5825 1.2224 1.2237 3.8404 3.3427 4.6775 2.8481 3.0779 2.1962 2.2074 3.4274 5.5465 1.9711 2.0532 5.5679 3.4425 3.3413 4.6621 6.9530 5.5388 5.4156 5.2395 5.2291 6.1956 1.0871 1.0874 1.0879 1.0885 1.0871 1.0879 1.0932 1.0892 1.0921 1.0914 1.0950 1.0956 1.0958 1.0971 1.0989 1.1001 1.0981 1.0825
irintensity: 15.3587 4.9992 8.1167 3.7344 0.8990 2.2330 1.1165 0.5222 0.2013 3.4995 0.5330 0.3785 6.2539 1.5018 6.7992 14.1363 18.3713 6.6139 5.1079 0.1977 21.2051 24.6872 48.2089 45.9740 96.4253 5.5513 9.7510 7.2306 1.4768 12.7691 0.0907 0.2033 14.8867 8.1063 15.3457 18.7305 1.5659 18.3285 94.8164 88.0086 7.8470 1.8208 6.2883 10.3430 8.7965 9.6987 20.2973 0.9118 0.8692 49.3890 22.2005 150.8857 43.3807 121.2081 4.3031 16.6391 120.9976 21.4710 28.1194 138.4628 78.6997 5.5684 2.8490 1.0028 17.5875 0.0947 0.0903 0.0693 1.1722 2.0239 7.8665 13.3853 1.4331 0.0371 0.3758 0.2318 22.6874 31.8138 0.0606 0.0648 18.8300 1.6947 0.9281 2.3353 4.1214 19.4903 27.5314 38.5489 26.2808 2.9587 76.9089 110.5450 3.7825 5.5839 145.2675 44.8056 63.8964 19.8020 57.3338 553.3001 63.5439 4.3806 0.7938 567.0740 281.8622 203.5947 2.6807 1.5017 749.9066 7.2500 182.8856 15.8327 313.5608 74.4784 56.2807 98.3542 593.0875 5.4119 26.1821 686.3180 69.0725 82.0564 413.0078 79.3458 11.8942 5.5625 54.1985 48.2618 9.7505 2.1120 2.3505 4.6493 4.0783 1.8930 4.5713 2.9609 2.4655 3.0979 6.9901 16.5396 31.6783 25.5791 31.4105 14.2153 8.6546 37.7572 264.1466
temp: 298.150 k
press: 1.00000 atm
elementType: 27 8 6 8 6 6 6 6 6 7 6 6 6 6 6 6 6 8 7 6 1 1 1 1 1 1 1 1 7 6 6 6 6 6 1 1 1 1 1 7 6 6 6 6 6 1 1 1 1 1 8
symmnumber: 1
zpe: 992432.1 jmol-1
zpe.correction: 0.377997 hartree
zpe.thermalcorrener: 0.406961 hartree
zpe.thermalcorrenthalpy: 0.407905 hartree
zpe.thermalcorrgfe: 0.313813 hartree
zpe.sumelectzpe: -1590.155538 hartree
zpe.sumelectthermal: -1590.126574 hartree
zpe.sumelectthermalent: -1590.125630 hartree
zpe.sumelectthermalfe: -1590.219723 hartree
dipole: 3.5514 22.0012 12.5500
dipole: 25.5767
quadrupole: -96.1463 -192.2353 -195.8643
quadrupole: 17.5309 -1.8719 -12.2990
quadrupole: 65.2690 -30.8200 -34.4490 17.5309 -1.8719 -12.2990
hfenergy: -1590.5335354 hartree
pointgroup: C01 [X(C24H18Co1N4O4)]
dipole: 0.6049055 9.0300197 4.3988074 debye
polarizability: 653.399184|-140.6945873|819.5705487|64.9937146|-40.7641251|383.9925202 unknown
InChI: InChI=1S/C14H8N2O3.2C5H5N.Co.O/c17-11-7-2-1-4-8(11)13-15-10-6-3-5-9(14(18)19)12(10)16-13;2*1-2-4-6-5-3-1;;/h1-7,15H;2*1-5H;;/q-3;;-1;+4;
charge 0 multiplicity 6
51 atoms
Co -0.46698317 -0.50053084 -0.86498077
O  1.31406611 -4.27933067 0.00818902
C  1.21153241 -3.02597227 -0.10876795
O  0.07197057 -2.4304829 -0.18091264
C  2.47560076 -2.20742882 -0.1245089
C  3.71633583 -2.83102555 0.02007012
C  4.93048584 -2.1115373 0.073411
C  4.96307217 -0.72281488 -0.00436273
C  3.7272585 -0.087423 -0.15078205
N  3.38709609 1.2408418 -0.25997554
C  2.02566485 1.33019517 -0.40384636
C  1.31805261 2.58623509 -0.53208113
C  1.99183697 3.80075435 -0.3426821
C  1.34515473 5.02939438 -0.48789095
C  -0.02471297 5.09189878 -0.83876588
C  -0.73029745 3.92946724 -1.02613056
C  -0.10882809 2.63520602 -0.87015622
O  -0.84321482 1.60397276 -1.03544573
N  1.47780604 0.10540221 -0.39361144
C  2.50042585 -0.79595687 -0.22588184
H  3.74017093 -3.91206575 0.1030291
H  5.85988104 -2.65964197 0.18717831
H  5.89045985 -0.16363072 0.0473718
H  4.04538519 2.01109517 -0.26995004
H  3.03888836 3.81020357 -0.06033057
H  1.90455725 5.94426921 -0.32572201
H  -0.51023781 6.05534245 -0.95150661
H  -1.78339634 3.93275343 -1.2868304
N  -2.61718969 -1.000306 -0.80742431
C  -3.14569622 -1.89757368 0.04743616
C  -4.50573328 -2.19958974 0.07028784
C  -5.35718723 -1.53970805 -0.81886515
C  -4.81372146 -0.60342601 -1.70079648
C  -3.4411035 -0.36607536 -1.66480881
H  -2.4492688 -2.37866839 0.72581862
H  -4.8825198 -2.93378462 0.77378582
H  -6.42172878 -1.75083627 -0.82382239
H  -5.43516938 -0.06488759 -2.4077735
H  -2.97457046 0.34642981 -2.3368334
N  -0.91633711 -0.01728443 1.37612099
C  -1.95278612 0.77125871 1.72415265
C  -2.25190464 1.088777 3.04783497
C  -1.44944003 0.56355401 4.06317883
C  -0.37612792 -0.2567237 3.71078799
C  -0.14588881 -0.51828609 2.36061116
H  -2.55702424 1.15482733 0.90874575
H  -3.09765926 1.73020439 3.27024339
H  -1.65660285 0.78792143 5.10473331
H  0.27482877 -0.6903815 4.46209641
H  0.67827632 -1.15072484 2.04890772
O  -0.33147682 -0.72391551 -2.56693351
